0 Replies Latest reply on Jul 13, 2017 11:52 AM by sergeyy34645446



      while compiling app for andriod fail with next error


      FAILURE: Build failed with an exception.


      * What went wrong:

      Execution failed for task ':transformClassesWithDexForDebug'.

      > com.android.build.api.transform.TransformException: com.android.ide.common.process.ProcessException: java.util.concurrent.ExecutionException: com.android.dex.DexException: Multiple dex files define Lcom/google/android/gms/iid/zzc;


      * Try:

      Run with --stacktrace option to get the stack trace. Run with --info or --debug option to get more log output.

        at ChildProcess.whenDone (/project/cordova/node_modules/cordova-common/src/superspawn.js:169:23)

        at emitTwo (events.js:106:13)

        at ChildProcess.emit (events.js:191:7)

        at maybeClose (internal/child_process.js:877:16)

        at Process.ChildProcess._handle.onexit (internal/child_process.js:226:5)


      please help