8 Replies Latest reply on Aug 2, 2012 7:59 AM by StevenErat

    [ERROR]   Unresolveable build extension

    StevenErat Level 1

      Hello,

       

      This is my first time working with FlexPMD.  I'm trying to build it from source.  It builds for about 1/2 hour while downloading, then fails with an error that I cannot properly interpret. 

       

      Can someone suggest a resolution or identify the problem?


      This is on Mac 10.7 with Ant 1.8.1 and Java 1.6.0_33.

       

      Thank you!

      Steve

       

      ----------------------

      mvn -X package amd

      Apache Maven 3.0.3 (r1075438; 2011-02-28 12:31:09-0500)

      Maven home: /usr/share/maven

      Java version: 1.6.0_33, vendor: Apple Inc.

      Java home: /System/Library/Java/JavaVirtualMachines/1.6.0.jdk/Contents/Home

      Default locale: en_US, platform encoding: MacRoman

      OS name: "mac os x", version: "10.7.4", arch: "x86_64", family: "mac"

      [INFO] Error stacktraces are turned on.

      [DEBUG] Reading global settings from /usr/share/maven/conf/settings.xml

      [DEBUG] Reading user settings from /Users/erat/.m2/settings.xml

      [DEBUG] Using local repository at /Users/erat/.m2/repository

      [DEBUG] Using manager EnhancedLocalRepositoryManager with priority 10 for /Users/erat/.m2/repository

      [INFO] Scanning for projects...

      [DEBUG] Extension realms for project com.adobe.ac:flex-pmd:pom:1.3-SNAPSHOT: (none)

      [DEBUG] Looking up lifecyle mappings for packaging pom from ClassRealm[plexus.core, parent: null]

      [DEBUG] Extension realms for project com.adobe.ac:flex-pmd-flex-parent:pom:1.3-SNAPSHOT: (none)

      [DEBUG] Looking up lifecyle mappings for packaging pom from ClassRealm[plexus.core, parent: null]

      [DEBUG] org.sonatype.flexmojos:flexmojos-maven-plugin:jar:3.5.0:

      [DEBUG]    org.sonatype.flexmojos:flexmojos-generator-api:jar:3.5.0:compile

      [DEBUG]       org.codehaus.plexus:plexus-container-default:jar:1.0-beta-3.0.6:compile

      [DEBUG]          org.codehaus.plexus:plexus-classworlds:jar:1.4:compile

      [DEBUG]          org.apache.xbean:xbean-reflect:jar:3.4:compile

      [DEBUG]             log4j:log4j:jar:1.2.12:compile

      [DEBUG]             commons-logging:commons-logging-api:jar:1.1:compile

      [DEBUG]          com.google.code.google-collections:google-collect:jar:snapshot-20080530:compile

      [DEBUG]    org.sonatype.flexmojos:flexmojos-generator-graniteds-1.1.0:jar:3.5.0:compile

      [DEBUG]       org.codehaus.groovy:groovy:jar:1.6.2:compile

      [DEBUG]          junit:junit:jar:3.8.2:compile

      [DEBUG]          org.apache.ant:ant:jar:1.7.1:compile

      [DEBUG]          org.apache.ant:ant-launcher:jar:1.7.1:compile

      [DEBUG]          asm:asm-util:jar:2.2.3:compile

      [DEBUG]          asm:asm-analysis:jar:2.2.3:compile

      [DEBUG]          asm:asm-tree:jar:2.2.3:compile

      [DEBUG]          jline:jline:jar:0.9.94:compile

      [DEBUG]       javax.persistence:persistence-api:jar:1.0:compile

      [DEBUG]       antlr:antlr:jar:2.7.7:compile

      [DEBUG]       asm:asm:jar:2.2:compile

      [DEBUG]    org.sonatype.flexmojos:flexmojos-generator-graniteds-2.0.0:jar:3.5.0:compile

      [DEBUG]       org.graniteds:granite-generator-share:jar:2.0.0.GA:compile

      [DEBUG]       org.codehaus.groovy:groovy-all:jar:1.6.2:compile

      [DEBUG]       javax.jdo:jdo2-api:jar:2.3-ea:compile

      [DEBUG]       javax.transaction:jta:jar:1.1:compile

      [DEBUG]    org.sonatype.flexmojos:flexmojos-generator-constraints:jar:3.5.0:compile

      [DEBUG]    com.adobe.flex:compiler:pom:3.2.0.3958:compile

      [DEBUG]       com.adobe.flex.compiler:asc:jar:3.2.0.3958:compile

      [DEBUG]       com.adobe.flex.compiler:asdoc:jar:3.2.0.3958:compile

      [DEBUG]       com.adobe.flex.compiler:batik-awt-util:jar:3.2.0.3958:compile

      [DEBUG]       com.adobe.flex.compiler:batik-bridge:jar:3.2.0.3958:compile

      [DEBUG]       com.adobe.flex.compiler:batik-css:jar:3.2.0.3958:compile

      [DEBUG]       com.adobe.flex.compiler:batik-dom:jar:3.2.0.3958:compile

      [DEBUG]       com.adobe.flex.compiler:batik-ext:jar:3.2.0.3958:compile

      [DEBUG]       com.adobe.flex.compiler:batik-gvt:jar:3.2.0.3958:compile

      [DEBUG]       com.adobe.flex.compiler:batik-parser:jar:3.2.0.3958:compile

      [DEBUG]       com.adobe.flex.compiler:batik-script:jar:3.2.0.3958:compile

      [DEBUG]       com.adobe.flex.compiler:batik-svg-dom:jar:3.2.0.3958:compile

      [DEBUG]       com.adobe.flex.compiler:batik-svggen:jar:3.2.0.3958:compile

      [DEBUG]       com.adobe.flex.compiler:batik-transcoder:jar:3.2.0.3958:compile

      [DEBUG]       com.adobe.flex.compiler:batik-util:jar:3.2.0.3958:compile

      [DEBUG]       com.adobe.flex.compiler:batik-xml:jar:3.2.0.3958:compile

      [DEBUG]       com.adobe.flex.compiler:commons-collections:jar:3.2.0.3958:compile

      [DEBUG]       com.adobe.flex.compiler:commons-discovery:jar:3.2.0.3958:compile

      [DEBUG]       com.adobe.flex.compiler:commons-logging:jar:3.2.0.3958:compile

      [DEBUG]       com.adobe.flex.compiler:compc:jar:3.2.0.3958:compile

      [DEBUG]       com.adobe.flex.compiler:copylocale:jar:3.2.0.3958:compile

      [DEBUG]       com.adobe.flex.compiler:digest:jar:3.2.0.3958:compile

      [DEBUG]       com.adobe.flex.compiler:fcsh:jar:3.2.0.3958:compile

      [DEBUG]       com.adobe.flex.compiler:fdb:jar:3.2.0.3958:compile

      [DEBUG]       com.adobe.flex.compiler:flex-compiler-oem:jar:3.2.0.3958:compile

      [DEBUG]       com.adobe.flex.compiler:flex-messaging-common:jar:3.2.0.3958:compile

      [DEBUG]       com.adobe.flex.compiler:mm-velocity:jar:3.2.0.3958:compile

      [DEBUG]       com.adobe.flex.compiler:mxmlc:jar:3.2.0.3958:compile

      [DEBUG]       com.adobe.flex.compiler:optimizer:jar:3.2.0.3958:compile

      [DEBUG]       com.adobe.flex.compiler:swfutils:jar:3.2.0.3958:compile

      [DEBUG]       com.adobe.flex.compiler:xalan:jar:3.2.0.3958:compile

      [DEBUG]       com.adobe.flex.compiler:xercesImpl:jar:3.2.0.3958:compile

      [DEBUG]       com.adobe.flex.compiler:xercesPatch:jar:3.2.0.3958:compile

      [DEBUG]       com.adobe.flex.compiler:xmlParserAPIs:jar:3.2.0.3958:compile

      [DEBUG]    com.adobe.flex.compiler:asdoc:zip:template:3.2.0.3958:compile

      [DEBUG]    dom4j:dom4j:jar:1.6.1:compile

      [DEBUG]       xml-apis:xml-apis:jar:1.0.b2:compile

      [DEBUG]    org.apache.maven:maven-plugin-api:jar:2.0.9:compile

      [DEBUG]    org.apache.maven:maven-project:jar:2.0.9:compile

      [DEBUG]       org.apache.maven:maven-settings:jar:2.0.9:compile

      [DEBUG]       org.apache.maven:maven-profile:jar:2.0.9:compile

      [DEBUG]       org.apache.maven:maven-model:jar:2.0.9:compile

      [DEBUG]       org.apache.maven:maven-artifact-manager:jar:2.0.9:compile

      [DEBUG]       org.apache.maven:maven-plugin-registry:jar:2.0.9:compile

      [DEBUG]       org.codehaus.plexus:plexus-utils:jar:1.5.1:compile

      [DEBUG]       org.apache.maven:maven-artifact:jar:2.0.9:compile

      [DEBUG]    org.apache.maven:maven-core:jar:2.0.9:compile

      [DEBUG]       org.apache.maven:maven-plugin-parameter-documenter:jar:2.0.9:compile

      [DEBUG]       org.apache.maven.reporting:maven-reporting-api:jar:2.0.9:compile

      [DEBUG]          org.apache.maven.doxia:doxia-sink-api:jar:1.0-alpha-10:compile

      [DEBUG]       org.apache.maven:maven-repository-metadata:jar:2.0.9:compile

      [DEBUG]       org.apache.maven:maven-error-diagnostics:jar:2.0.9:compile

      [DEBUG]       commons-cli:commons-cli:jar:1.0:compile

      [DEBUG]       org.apache.maven:maven-plugin-descriptor:jar:2.0.9:compile

      [DEBUG]       org.codehaus.plexus:plexus-interactivity-api:jar:1.0-alpha-4:compile

      [DEBUG]       org.apache.maven:maven-monitor:jar:2.0.9:compile

      [DEBUG]       classworlds:classworlds:jar:1.1:compile

      [DEBUG]    jaxen:jaxen:jar:1.1:compile

      [DEBUG]       jdom:jdom:jar:1.0:compile

      [DEBUG]       xerces:xercesImpl:jar:2.6.2:compile

      [DEBUG]       xom:xom:jar:1.0:compile

      [DEBUG]          xerces:xmlParserAPIs:jar:2.6.2:compile

      [DEBUG]          xalan:xalan:jar:2.6.0:compile

      [DEBUG]          com.ibm.icu:icu4j:jar:2.6.1:compile

      [DEBUG]    org.graniteds:granite-generator:jar:1.1.0:compile

      [DEBUG]    org.apache.maven.plugins:maven-eclipse-plugin:jar:2.5:compile

      [DEBUG]       org.codehaus.plexus:plexus-archiver:jar:1.0-alpha-7:provided (scope managed from compile)

      [DEBUG]       org.codehaus.plexus:plexus-interactivity-jline:jar:1.0-alpha-5:compile

      [DEBUG]       org.apache.maven:maven-archiver:jar:2.2:compile

      [DEBUG]       org.codehaus.plexus:plexus-resources:jar:1.0-alpha-4:compile

      [DEBUG]       biz.aQute:bndlib:jar:0.0.145:compile

      [DEBUG]       org.apache.maven.shared:maven-osgi:jar:0.2.0:compile

      [DEBUG]       org.eclipse.core:resources:jar:3.3.0-v20070604:compile

      [DEBUG]    org.apache.maven.reporting:maven-reporting-impl:jar:2.0.2:compile

      [DEBUG]       commons-validator:commons-validator:jar:1.1.4:compile

      [DEBUG]       org.apache.maven.doxia:doxia-core:jar:1.0-alpha-7:compile

      [DEBUG]       oro:oro:jar:2.0.7:compile

      [DEBUG]       org.apache.maven.doxia:doxia-site-renderer:jar:1.0-alpha-7:compile

      [DEBUG]          org.codehaus.plexus:plexus-i18n:jar:1.0-beta-6:compile

      [DEBUG]          org.codehaus.plexus:plexus-velocity:jar:1.1.2:compile

      [DEBUG]             plexus:plexus-utils:jar:1.0.2:compile

      [DEBUG]             commons-collections:commons-collections:jar:2.0:compile

      [DEBUG]             velocity:velocity:jar:1.4:compile

      [DEBUG]                velocity:velocity-dep:jar:1.4:runtime

      [DEBUG]          org.apache.maven.doxia:doxia-decoration-model:jar:1.0-alpha-7:compile

      [DEBUG]    commons-lang:commons-lang:jar:2.4:compile

      [DEBUG]    commons-io:commons-io:jar:1.4:compile

      [DEBUG]    commons-httpclient:commons-httpclient:jar:3.1:compile

      [DEBUG]       commons-logging:commons-logging:jar:1.0.4:compile

      [DEBUG]       commons-codec:commons-codec:jar:1.3:compile (version managed from 1.2)

      [DEBUG]    org.apache.maven.plugins:maven-source-plugin:jar:2.0.4:compile

      [DEBUG]    de.java2html:java2html:jar:5.0:compile

      [DEBUG]    org.aspectj:aspectjrt:jar:1.6.5:compile

      [DEBUG]    eu.cedarsoft.utils:zip:jar:1.1:compile

      [DEBUG]       eu.cedarsoft:guice-annotations:jar:1.0:compile

      [DEBUG]       com.intellij:annotations:jar:6.0.3:compile

      [DEBUG]    org.codehaus.plexus:plexus-component-annotations:jar:1.0-beta-3.0.6:compile

      [DEBUG]    org.jvnet:animal-sniffer-annotation:jar:1.0:compile

      [DEBUG]    org.sonatype.flexmojos:flexmojos-tester:jar:3.5.0:compile

      [DEBUG]    net.sf.saxon:saxon-dom:jar:9.0:compile

      [DEBUG]    org.apache.maven.shared:maven-common-artifact-filters:jar:1.2:compile

      [DEBUG]       org.apache.maven.shared:maven-plugin-testing-harness:jar:1.1:compile

      [DEBUG] Created new class realm maven.api

      [DEBUG] Importing foreign packages into class realm maven.api

      [DEBUG]   Imported: org.apache.maven.wagon.events < plexus.core

      [DEBUG]   Imported: org.sonatype.aether.transfer < plexus.core

      [DEBUG]   Imported: org.apache.maven.exception < plexus.core

      [DEBUG]   Imported: org.sonatype.aether.metadata < plexus.core

      [DEBUG]   Imported: org.codehaus.plexus.util.xml.Xpp3Dom < plexus.core

      [DEBUG]   Imported: org.sonatype.aether.collection < plexus.core

      [DEBUG]   Imported: org.sonatype.aether.version < plexus.core

      [DEBUG]   Imported: org.apache.maven.monitor < plexus.core

      [DEBUG]   Imported: org.apache.maven.wagon.repository < plexus.core

      [DEBUG]   Imported: org.apache.maven.repository < plexus.core

      [DEBUG]   Imported: org.apache.maven.wagon.resource < plexus.core

      [DEBUG]   Imported: org.codehaus.plexus.logging < plexus.core

      [DEBUG]   Imported: org.apache.maven.profiles < plexus.core

      [DEBUG]   Imported: org.sonatype.aether.repository < plexus.core

      [DEBUG]   Imported: org.apache.maven.classrealm < plexus.core

      [DEBUG]   Imported: org.apache.maven.execution < plexus.core

      [DEBUG]   Imported: org.sonatype.aether.artifact < plexus.core

      [DEBUG]   Imported: org.sonatype.aether.spi < plexus.core

      [DEBUG]   Imported: org.apache.maven.reporting < plexus.core

      [DEBUG]   Imported: org.apache.maven.usability < plexus.core

      [DEBUG]   Imported: org.codehaus.plexus.container < plexus.core

      [DEBUG]   Imported: org.codehaus.plexus.component < plexus.core

      [DEBUG]   Imported: org.codehaus.plexus.util.xml.pull.XmlSerializer < plexus.core

      [DEBUG]   Imported: org.apache.maven.wagon.authentication < plexus.core

      [DEBUG]   Imported: org.apache.maven.lifecycle < plexus.core

      [DEBUG]   Imported: org.codehaus.plexus.classworlds < plexus.core

      [DEBUG]   Imported: org.sonatype.aether.graph < plexus.core

      [DEBUG]   Imported: org.sonatype.aether.* < plexus.core

      [DEBUG]   Imported: org.apache.maven.settings < plexus.core

      [DEBUG]   Imported: org.codehaus.classworlds < plexus.core

      [DEBUG]   Imported: org.sonatype.aether.impl < plexus.core

      [DEBUG]   Imported: org.apache.maven.wagon.* < plexus.core

      [DEBUG]   Imported: org.apache.maven.toolchain < plexus.core

      [DEBUG]   Imported: org.sonatype.aether.deployment < plexus.core

      [DEBUG]   Imported: org.apache.maven.wagon.observers < plexus.core

      [DEBUG]   Imported: org.codehaus.plexus.util.xml.pull.XmlPullParserException < plexus.core

      [DEBUG]   Imported: org.codehaus.plexus.util.xml.pull.XmlPullParser < plexus.core

      [DEBUG]   Imported: org.apache.maven.configuration < plexus.core

      [DEBUG]   Imported: org.apache.maven.cli < plexus.core

      [DEBUG]   Imported: org.sonatype.aether.installation < plexus.core

      [DEBUG]   Imported: org.codehaus.plexus.context < plexus.core

      [DEBUG]   Imported: org.apache.maven.wagon.authorization < plexus.core

      [DEBUG]   Imported: org.apache.maven.project < plexus.core

      [DEBUG]   Imported: org.apache.maven.rtinfo < plexus.core

      [DEBUG]   Imported: org.codehaus.plexus.lifecycle < plexus.core

      [DEBUG]   Imported: org.codehaus.plexus.configuration < plexus.core

      [DEBUG]   Imported: org.apache.maven.artifact < plexus.core

      [DEBUG]   Imported: org.apache.maven.model < plexus.core

      [DEBUG]   Imported: org.apache.maven.* < plexus.core

      [DEBUG]   Imported: org.apache.maven.wagon.proxy < plexus.core

      [DEBUG]   Imported: org.sonatype.aether.resolution < plexus.core

      [DEBUG]   Imported: org.apache.maven.plugin < plexus.core

      [DEBUG]   Imported: org.codehaus.plexus.* < plexus.core

      [DEBUG]   Imported: org.codehaus.plexus.personality < plexus.core

      [DEBUG] Populating class realm maven.api

      [DEBUG] Created new class realm extension>org.sonatype.flexmojos:flexmojos-maven-plugin:3.5.0

      [DEBUG] Importing foreign packages into class realm extension>org.sonatype.flexmojos:flexmojos-maven-plugin:3.5.0

      [DEBUG]   Imported:  < maven.api

      [DEBUG] Populating class realm extension>org.sonatype.flexmojos:flexmojos-maven-plugin:3.5.0

      [DEBUG]   Included: org.sonatype.flexmojos:flexmojos-maven-plugin:jar:3.5.0

      [DEBUG]   Included: org.sonatype.flexmojos:flexmojos-generator-api:jar:3.5.0

      [DEBUG]   Included: org.apache.xbean:xbean-reflect:jar:3.4

      [DEBUG]   Included: log4j:log4j:jar:1.2.12

      [DEBUG]   Included: commons-logging:commons-logging-api:jar:1.1

      [DEBUG]   Included: com.google.code.google-collections:google-collect:jar:snapshot-20080530

      [DEBUG]   Included: org.sonatype.flexmojos:flexmojos-generator-graniteds-1.1.0:jar:3.5.0

      [DEBUG]   Included: org.codehaus.groovy:groovy:jar:1.6.2

      [DEBUG]   Included: junit:junit:jar:3.8.2

      [DEBUG]   Included: org.apache.ant:ant:jar:1.7.1

      [DEBUG]   Included: org.apache.ant:ant-launcher:jar:1.7.1

      [DEBUG]   Included: asm:asm-util:jar:2.2.3

      [DEBUG]   Included: asm:asm-analysis:jar:2.2.3

      [DEBUG]   Included: asm:asm-tree:jar:2.2.3

      [DEBUG]   Included: jline:jline:jar:0.9.94

      [DEBUG]   Included: javax.persistence:persistence-api:jar:1.0

      [DEBUG]   Included: antlr:antlr:jar:2.7.7

      [DEBUG]   Included: asm:asm:jar:2.2

      [DEBUG]   Included: org.sonatype.flexmojos:flexmojos-generator-graniteds-2.0.0:jar:3.5.0

      [DEBUG]   Included: org.graniteds:granite-generator-share:jar:2.0.0.GA

      [DEBUG]   Included: org.codehaus.groovy:groovy-all:jar:1.6.2

      [DEBUG]   Included: javax.jdo:jdo2-api:jar:2.3-ea

      [DEBUG]   Included: javax.transaction:jta:jar:1.1

      [DEBUG]   Included: org.sonatype.flexmojos:flexmojos-generator-constraints:jar:3.5.0

      [DEBUG]   Included: com.adobe.flex:compiler:pom:3.2.0.3958

      [DEBUG]   Included: com.adobe.flex.compiler:asc:jar:3.2.0.3958

      [DEBUG]   Included: com.adobe.flex.compiler:asdoc:jar:3.2.0.3958

      [DEBUG]   Included: com.adobe.flex.compiler:batik-awt-util:jar:3.2.0.3958

      [DEBUG]   Included: com.adobe.flex.compiler:batik-bridge:jar:3.2.0.3958

      [DEBUG]   Included: com.adobe.flex.compiler:batik-css:jar:3.2.0.3958

      [DEBUG]   Included: com.adobe.flex.compiler:batik-dom:jar:3.2.0.3958

      [DEBUG]   Included: com.adobe.flex.compiler:batik-ext:jar:3.2.0.3958

      [DEBUG]   Included: com.adobe.flex.compiler:batik-gvt:jar:3.2.0.3958

      [DEBUG]   Included: com.adobe.flex.compiler:batik-parser:jar:3.2.0.3958

      [DEBUG]   Included: com.adobe.flex.compiler:batik-script:jar:3.2.0.3958

      [DEBUG]   Included: com.adobe.flex.compiler:batik-svg-dom:jar:3.2.0.3958

      [DEBUG]   Included: com.adobe.flex.compiler:batik-svggen:jar:3.2.0.3958

      [DEBUG]   Included: com.adobe.flex.compiler:batik-transcoder:jar:3.2.0.3958

      [DEBUG]   Included: com.adobe.flex.compiler:batik-util:jar:3.2.0.3958

      [DEBUG]   Included: com.adobe.flex.compiler:batik-xml:jar:3.2.0.3958

      [DEBUG]   Included: com.adobe.flex.compiler:commons-collections:jar:3.2.0.3958

      [DEBUG]   Included: com.adobe.flex.compiler:commons-discovery:jar:3.2.0.3958

      [DEBUG]   Included: com.adobe.flex.compiler:commons-logging:jar:3.2.0.3958

      [DEBUG]   Included: com.adobe.flex.compiler:compc:jar:3.2.0.3958

      [DEBUG]   Included: com.adobe.flex.compiler:copylocale:jar:3.2.0.3958

      [DEBUG]   Included: com.adobe.flex.compiler:digest:jar:3.2.0.3958

      [DEBUG]   Included: com.adobe.flex.compiler:fcsh:jar:3.2.0.3958

      [DEBUG]   Included: com.adobe.flex.compiler:fdb:jar:3.2.0.3958

      [DEBUG]   Included: com.adobe.flex.compiler:flex-compiler-oem:jar:3.2.0.3958

      [DEBUG]   Included: com.adobe.flex.compiler:flex-messaging-common:jar:3.2.0.3958

      [DEBUG]   Included: com.adobe.flex.compiler:mm-velocity:jar:3.2.0.3958

      [DEBUG]   Included: com.adobe.flex.compiler:mxmlc:jar:3.2.0.3958

      [DEBUG]   Included: com.adobe.flex.compiler:optimizer:jar:3.2.0.3958

      [DEBUG]   Included: com.adobe.flex.compiler:swfutils:jar:3.2.0.3958

      [DEBUG]   Included: com.adobe.flex.compiler:xalan:jar:3.2.0.3958

      [DEBUG]   Included: com.adobe.flex.compiler:xercesImpl:jar:3.2.0.3958

      [DEBUG]   Included: com.adobe.flex.compiler:xercesPatch:jar:3.2.0.3958

      [DEBUG]   Included: com.adobe.flex.compiler:xmlParserAPIs:jar:3.2.0.3958

      [DEBUG]   Included: com.adobe.flex.compiler:asdoc:zip:template:3.2.0.3958

      [DEBUG]   Included: dom4j:dom4j:jar:1.6.1

      [DEBUG]   Included: xml-apis:xml-apis:jar:1.0.b2

      [DEBUG]   Included: org.codehaus.plexus:plexus-utils:jar:1.5.1

      [DEBUG]   Included: org.apache.maven.reporting:maven-reporting-api:jar:2.0.9

      [DEBUG]   Included: org.apache.maven.doxia:doxia-sink-api:jar:1.0-alpha-10

      [DEBUG]   Included: commons-cli:commons-cli:jar:1.0

      [DEBUG]   Included: org.codehaus.plexus:plexus-interactivity-api:jar:1.0-alpha-4

      [DEBUG]   Included: jaxen:jaxen:jar:1.1

      [DEBUG]   Included: jdom:jdom:jar:1.0

      [DEBUG]   Included: xerces:xercesImpl:jar:2.6.2

      [DEBUG]   Included: xom:xom:jar:1.0

      [DEBUG]   Included: xerces:xmlParserAPIs:jar:2.6.2

      [DEBUG]   Included: xalan:xalan:jar:2.6.0

      [DEBUG]   Included: com.ibm.icu:icu4j:jar:2.6.1

      [DEBUG]   Included: org.graniteds:granite-generator:jar:1.1.0

      [DEBUG]   Included: org.apache.maven.plugins:maven-eclipse-plugin:jar:2.5

      [DEBUG]   Included: org.codehaus.plexus:plexus-interactivity-jline:jar:1.0-alpha-5

      [DEBUG]   Included: org.apache.maven:maven-archiver:jar:2.2

      [DEBUG]   Included: org.codehaus.plexus:plexus-resources:jar:1.0-alpha-4

      [DEBUG]   Included: biz.aQute:bndlib:jar:0.0.145

      [DEBUG]   Included: org.apache.maven.shared:maven-osgi:jar:0.2.0

      [DEBUG]   Included: org.eclipse.core:resources:jar:3.3.0-v20070604

      [DEBUG]   Included: org.apache.maven.reporting:maven-reporting-impl:jar:2.0.2

      [DEBUG]   Included: commons-validator:commons-validator:jar:1.1.4

      [DEBUG]   Included: org.apache.maven.doxia:doxia-core:jar:1.0-alpha-7

      [DEBUG]   Included: oro:oro:jar:2.0.7

      [DEBUG]   Included: org.apache.maven.doxia:doxia-site-renderer:jar:1.0-alpha-7

      [DEBUG]   Included: org.codehaus.plexus:plexus-i18n:jar:1.0-beta-6

      [DEBUG]   Included: org.codehaus.plexus:plexus-velocity:jar:1.1.2

      [DEBUG]   Included: plexus:plexus-utils:jar:1.0.2

      [DEBUG]   Included: commons-collections:commons-collections:jar:2.0

      [DEBUG]   Included: velocity:velocity:jar:1.4

      [DEBUG]   Included: velocity:velocity-dep:jar:1.4

      [DEBUG]   Included: org.apache.maven.doxia:doxia-decoration-model:jar:1.0-alpha-7

      [DEBUG]   Included: commons-lang:commons-lang:jar:2.4

      [DEBUG]   Included: commons-io:commons-io:jar:1.4

      [DEBUG]   Included: commons-httpclient:commons-httpclient:jar:3.1

      [DEBUG]   Included: commons-logging:commons-logging:jar:1.0.4

      [DEBUG]   Included: commons-codec:commons-codec:jar:1.3

      [DEBUG]   Included: org.apache.maven.plugins:maven-source-plugin:jar:2.0.4

      [DEBUG]   Included: de.java2html:java2html:jar:5.0

      [DEBUG]   Included: org.aspectj:aspectjrt:jar:1.6.5

      [DEBUG]   Included: eu.cedarsoft.utils:zip:jar:1.1

      [DEBUG]   Included: eu.cedarsoft:guice-annotations:jar:1.0

      [DEBUG]   Included: com.intellij:annotations:jar:6.0.3

      [DEBUG]   Included: org.codehaus.plexus:plexus-component-annotations:jar:1.0-beta-3.0.6

      [DEBUG]   Included: org.jvnet:animal-sniffer-annotation:jar:1.0

      [DEBUG]   Included: org.sonatype.flexmojos:flexmojos-tester:jar:3.5.0

      [DEBUG]   Included: net.sf.saxon:saxon-dom:jar:9.0

      [DEBUG]   Included: org.apache.maven.shared:maven-common-artifact-filters:jar:1.2

      [DEBUG]   Included: org.apache.maven.shared:maven-plugin-testing-harness:jar:1.1

      [DEBUG] Extension realms for project com.adobe.ac:flex-pmd-ruleset-creator:swf:1.3-SNAPSHOT: [ClassRealm[extension>org.sonatype.flexmojos:flexmojos-maven-plugin:3.5.0, parent: sun.misc.Launcher$AppClassLoader@7a9664a1]]

      [DEBUG] Created new class realm project>com.adobe.ac:flex-pmd-ruleset-creator:1.3-SNAPSHOT

      [DEBUG] Populating class realm project>com.adobe.ac:flex-pmd-ruleset-creator:1.3-SNAPSHOT

      [DEBUG] Looking up lifecyle mappings for packaging swf from ClassRealm[project>com.adobe.ac:flex-pmd-ruleset-creator:1.3-SNAPSHOT, parent: ClassRealm[maven.api, parent: null]]

      [DEBUG] org.sonatype.flexmojos:flexmojos-maven-plugin:jar:3.5.0:

      [DEBUG]    org.sonatype.flexmojos:flexmojos-generator-api:jar:3.5.0:compile

      [DEBUG]       org.codehaus.plexus:plexus-container-default:jar:1.0-beta-3.0.6:compile

      [DEBUG]          org.codehaus.plexus:plexus-classworlds:jar:1.4:compile

      [DEBUG]          org.apache.xbean:xbean-reflect:jar:3.4:compile

      [DEBUG]             log4j:log4j:jar:1.2.12:compile

      [DEBUG]             commons-logging:commons-logging-api:jar:1.1:compile

      [DEBUG]          com.google.code.google-collections:google-collect:jar:snapshot-20080530:compile

      [DEBUG]    org.sonatype.flexmojos:flexmojos-generator-graniteds-1.1.0:jar:3.5.0:compile

      [DEBUG]       org.codehaus.groovy:groovy:jar:1.6.2:compile

      [DEBUG]          junit:junit:jar:3.8.2:compile

      [DEBUG]          org.apache.ant:ant:jar:1.7.1:compile

      [DEBUG]          org.apache.ant:ant-launcher:jar:1.7.1:compile

      [DEBUG]          asm:asm-util:jar:2.2.3:compile

      [DEBUG]          asm:asm-analysis:jar:2.2.3:compile

      [DEBUG]          asm:asm-tree:jar:2.2.3:compile

      [DEBUG]          jline:jline:jar:0.9.94:compile

      [DEBUG]       javax.persistence:persistence-api:jar:1.0:compile

      [DEBUG]       antlr:antlr:jar:2.7.7:compile

      [DEBUG]       asm:asm:jar:2.2:compile

      [DEBUG]    org.sonatype.flexmojos:flexmojos-generator-graniteds-2.0.0:jar:3.5.0:compile

      [DEBUG]       org.graniteds:granite-generator-share:jar:2.0.0.GA:compile

      [DEBUG]       org.codehaus.groovy:groovy-all:jar:1.6.2:compile

      [DEBUG]       javax.jdo:jdo2-api:jar:2.3-ea:compile

      [DEBUG]       javax.transaction:jta:jar:1.1:compile

      [DEBUG]    org.sonatype.flexmojos:flexmojos-generator-constraints:jar:3.5.0:compile

      [DEBUG]    com.adobe.flex:compiler:pom:3.2.0.3958:compile

      [DEBUG]       com.adobe.flex.compiler:asc:jar:3.2.0.3958:compile

      [DEBUG]       com.adobe.flex.compiler:asdoc:jar:3.2.0.3958:compile

      [DEBUG]       com.adobe.flex.compiler:batik-awt-util:jar:3.2.0.3958:compile

      [DEBUG]       com.adobe.flex.compiler:batik-bridge:jar:3.2.0.3958:compile

      [DEBUG]       com.adobe.flex.compiler:batik-css:jar:3.2.0.3958:compile

      [DEBUG]       com.adobe.flex.compiler:batik-dom:jar:3.2.0.3958:compile

      [DEBUG]       com.adobe.flex.compiler:batik-ext:jar:3.2.0.3958:compile

      [DEBUG]       com.adobe.flex.compiler:batik-gvt:jar:3.2.0.3958:compile

      [DEBUG]       com.adobe.flex.compiler:batik-parser:jar:3.2.0.3958:compile

      [DEBUG]       com.adobe.flex.compiler:batik-script:jar:3.2.0.3958:compile

      [DEBUG]       com.adobe.flex.compiler:batik-svg-dom:jar:3.2.0.3958:compile

      [DEBUG]       com.adobe.flex.compiler:batik-svggen:jar:3.2.0.3958:compile

      [DEBUG]       com.adobe.flex.compiler:batik-transcoder:jar:3.2.0.3958:compile

      [DEBUG]       com.adobe.flex.compiler:batik-util:jar:3.2.0.3958:compile

      [DEBUG]       com.adobe.flex.compiler:batik-xml:jar:3.2.0.3958:compile

      [DEBUG]       com.adobe.flex.compiler:commons-collections:jar:3.2.0.3958:compile

      [DEBUG]       com.adobe.flex.compiler:commons-discovery:jar:3.2.0.3958:compile

      [DEBUG]       com.adobe.flex.compiler:commons-logging:jar:3.2.0.3958:compile

      [DEBUG]       com.adobe.flex.compiler:compc:jar:3.2.0.3958:compile

      [DEBUG]       com.adobe.flex.compiler:copylocale:jar:3.2.0.3958:compile

      [DEBUG]       com.adobe.flex.compiler:digest:jar:3.2.0.3958:compile

      [DEBUG]       com.adobe.flex.compiler:fcsh:jar:3.2.0.3958:compile

      [DEBUG]       com.adobe.flex.compiler:fdb:jar:3.2.0.3958:compile

      [DEBUG]       com.adobe.flex.compiler:flex-compiler-oem:jar:3.2.0.3958:compile

      [DEBUG]       com.adobe.flex.compiler:flex-messaging-common:jar:3.2.0.3958:compile

      [DEBUG]       com.adobe.flex.compiler:mm-velocity:jar:3.2.0.3958:compile

      [DEBUG]       com.adobe.flex.compiler:mxmlc:jar:3.2.0.3958:compile

      [DEBUG]       com.adobe.flex.compiler:optimizer:jar:3.2.0.3958:compile

      [DEBUG]       com.adobe.flex.compiler:swfutils:jar:3.2.0.3958:compile

      [DEBUG]       com.adobe.flex.compiler:xalan:jar:3.2.0.3958:compile

      [DEBUG]       com.adobe.flex.compiler:xercesImpl:jar:3.2.0.3958:compile

      [DEBUG]       com.adobe.flex.compiler:xercesPatch:jar:3.2.0.3958:compile

      [DEBUG]       com.adobe.flex.compiler:xmlParserAPIs:jar:3.2.0.3958:compile

      [DEBUG]    com.adobe.flex.compiler:asdoc:zip:template:3.2.0.3958:compile

      [DEBUG]    dom4j:dom4j:jar:1.6.1:compile

      [DEBUG]       xml-apis:xml-apis:jar:1.0.b2:compile

      [DEBUG]    org.apache.maven:maven-plugin-api:jar:2.0.9:compile

      [DEBUG]    org.apache.maven:maven-project:jar:2.0.9:compile

      [DEBUG]       org.apache.maven:maven-settings:jar:2.0.9:compile

      [DEBUG]       org.apache.maven:maven-profile:jar:2.0.9:compile

      [DEBUG]       org.apache.maven:maven-model:jar:2.0.9:compile

      [DEBUG]       org.apache.maven:maven-artifact-manager:jar:2.0.9:compile

      [DEBUG]       org.apache.maven:maven-plugin-registry:jar:2.0.9:compile

      [DEBUG]       org.codehaus.plexus:plexus-utils:jar:1.5.1:compile

      [DEBUG]       org.apache.maven:maven-artifact:jar:2.0.9:compile

      [DEBUG]    org.apache.maven:maven-core:jar:2.0.9:compile

      [DEBUG]       org.apache.maven:maven-plugin-parameter-documenter:jar:2.0.9:compile

      [DEBUG]       org.apache.maven.reporting:maven-reporting-api:jar:2.0.9:compile

      [DEBUG]          org.apache.maven.doxia:doxia-sink-api:jar:1.0-alpha-10:compile

      [DEBUG]       org.apache.maven:maven-repository-metadata:jar:2.0.9:compile

      [DEBUG]       org.apache.maven:maven-error-diagnostics:jar:2.0.9:compile

      [DEBUG]       commons-cli:commons-cli:jar:1.0:compile

      [DEBUG]       org.apache.maven:maven-plugin-descriptor:jar:2.0.9:compile

      [DEBUG]       org.codehaus.plexus:plexus-interactivity-api:jar:1.0-alpha-4:compile

      [DEBUG]       org.apache.maven:maven-monitor:jar:2.0.9:compile

      [DEBUG]       classworlds:classworlds:jar:1.1:compile

      [DEBUG]    jaxen:jaxen:jar:1.1:compile

      [DEBUG]       jdom:jdom:jar:1.0:compile

      [DEBUG]       xerces:xercesImpl:jar:2.6.2:compile

      [DEBUG]       xom:xom:jar:1.0:compile

      [DEBUG]          xerces:xmlParserAPIs:jar:2.6.2:compile

      [DEBUG]          xalan:xalan:jar:2.6.0:compile

      [DEBUG]          com.ibm.icu:icu4j:jar:2.6.1:compile

      [DEBUG]    org.graniteds:granite-generator:jar:1.1.0:compile

      [DEBUG]    org.apache.maven.plugins:maven-eclipse-plugin:jar:2.5:compile

      [DEBUG]       org.codehaus.plexus:plexus-archiver:jar:1.0-alpha-7:provided (scope managed from compile)

      [DEBUG]       org.codehaus.plexus:plexus-interactivity-jline:jar:1.0-alpha-5:compile

      [DEBUG]       org.apache.maven:maven-archiver:jar:2.2:compile

      [DEBUG]       org.codehaus.plexus:plexus-resources:jar:1.0-alpha-4:compile

      [DEBUG]       biz.aQute:bndlib:jar:0.0.145:compile

      [DEBUG]       org.apache.maven.shared:maven-osgi:jar:0.2.0:compile

      [DEBUG]       org.eclipse.core:resources:jar:3.3.0-v20070604:compile

      [DEBUG]    org.apache.maven.reporting:maven-reporting-impl:jar:2.0.2:compile

      [DEBUG]       commons-validator:commons-validator:jar:1.1.4:compile

      [DEBUG]       org.apache.maven.doxia:doxia-core:jar:1.0-alpha-7:compile

      [DEBUG]       oro:oro:jar:2.0.7:compile

      [DEBUG]       org.apache.maven.doxia:doxia-site-renderer:jar:1.0-alpha-7:compile

      [DEBUG]          org.codehaus.plexus:plexus-i18n:jar:1.0-beta-6:compile

      [DEBUG]          org.codehaus.plexus:plexus-velocity:jar:1.1.2:compile

      [DEBUG]             plexus:plexus-utils:jar:1.0.2:compile

      [DEBUG]             commons-collections:commons-collections:jar:2.0:compile

      [DEBUG]             velocity:velocity:jar:1.4:compile

      [DEBUG]                velocity:velocity-dep:jar:1.4:runtime

      [DEBUG]          org.apache.maven.doxia:doxia-decoration-model:jar:1.0-alpha-7:compile

      [DEBUG]    commons-lang:commons-lang:jar:2.4:compile

      [DEBUG]    commons-io:commons-io:jar:1.4:compile

      [DEBUG]    commons-httpclient:commons-httpclient:jar:3.1:compile

      [DEBUG]       commons-logging:commons-logging:jar:1.0.4:compile

      [DEBUG]       commons-codec:commons-codec:jar:1.3:compile (version managed from 1.2)

      [DEBUG]    org.apache.maven.plugins:maven-source-plugin:jar:2.0.4:compile

      [DEBUG]    de.java2html:java2html:jar:5.0:compile

      [DEBUG]    org.aspectj:aspectjrt:jar:1.6.5:compile

      [DEBUG]    eu.cedarsoft.utils:zip:jar:1.1:compile

      [DEBUG]       eu.cedarsoft:guice-annotations:jar:1.0:compile

      [DEBUG]       com.intellij:annotations:jar:6.0.3:compile

      [DEBUG]    org.codehaus.plexus:plexus-component-annotations:jar:1.0-beta-3.0.6:compile

      [DEBUG]    org.jvnet:animal-sniffer-annotation:jar:1.0:compile

      [DEBUG]    org.sonatype.flexmojos:flexmojos-tester:jar:3.5.0:compile

      [DEBUG]    net.sf.saxon:saxon-dom:jar:9.0:compile

      [DEBUG]    org.apache.maven.shared:maven-common-artifact-filters:jar:1.2:compile

      [DEBUG]       org.apache.maven.shared:maven-plugin-testing-harness:jar:1.1:compile

      [DEBUG] Extension realms for project com.adobe.ac:flex-pmd-violations-viewer:swf:1.3-SNAPSHOT: [ClassRealm[extension>org.sonatype.flexmojos:flexmojos-maven-plugin:3.5.0, parent: sun.misc.Launcher$AppClassLoader@7a9664a1]]

      [DEBUG] Looking up lifecyle mappings for packaging swf from ClassRealm[project>com.adobe.ac:flex-pmd-ruleset-creator:1.3-SNAPSHOT, parent: ClassRealm[maven.api, parent: null]]

      [DEBUG] Extension realms for project com.adobe.ac:flex-pmd-flex-lib:swc:1.3-SNAPSHOT: [ClassRealm[extension>org.sonatype.flexmojos:flexmojos-maven-plugin:3.5.0, parent: sun.misc.Launcher$AppClassLoader@7a9664a1]]

      [DEBUG] Looking up lifecyle mappings for packaging swc from ClassRealm[project>com.adobe.ac:flex-pmd-ruleset-creator:1.3-SNAPSHOT, parent: ClassRealm[maven.api, parent: null]]

      [DEBUG] org.sonatype.flexmojos:flexmojos-maven-plugin:jar:3.5.0:

      [DEBUG]    org.sonatype.flexmojos:flexmojos-generator-api:jar:3.5.0:compile

      [DEBUG]       org.codehaus.plexus:plexus-container-default:jar:1.0-beta-3.0.6:compile

      [DEBUG]          org.codehaus.plexus:plexus-classworlds:jar:1.4:compile

      [DEBUG]          org.apache.xbean:xbean-reflect:jar:3.4:compile

      [DEBUG]             log4j:log4j:jar:1.2.12:compile

      [DEBUG]             commons-logging:commons-logging-api:jar:1.1:compile

      [DEBUG]          com.google.code.google-collections:google-collect:jar:snapshot-20080530:compile

      [DEBUG]    org.sonatype.flexmojos:flexmojos-generator-graniteds-1.1.0:jar:3.5.0:compile

      [DEBUG]       org.codehaus.groovy:groovy:jar:1.6.2:compile

      [DEBUG]          junit:junit:jar:3.8.2:compile

      [DEBUG]          org.apache.ant:ant:jar:1.7.1:compile

      [DEBUG]          org.apache.ant:ant-launcher:jar:1.7.1:compile

      [DEBUG]          asm:asm-util:jar:2.2.3:compile

      [DEBUG]          asm:asm-analysis:jar:2.2.3:compile

      [DEBUG]          asm:asm-tree:jar:2.2.3:compile

      [DEBUG]          jline:jline:jar:0.9.94:compile

      [DEBUG]       javax.persistence:persistence-api:jar:1.0:compile

      [DEBUG]       antlr:antlr:jar:2.7.7:compile

      [DEBUG]       asm:asm:jar:2.2:compile

      [DEBUG]    org.sonatype.flexmojos:flexmojos-generator-graniteds-2.0.0:jar:3.5.0:compile

      [DEBUG]       org.graniteds:granite-generator-share:jar:2.0.0.GA:compile

      [DEBUG]       org.codehaus.groovy:groovy-all:jar:1.6.2:compile

      [DEBUG]       javax.jdo:jdo2-api:jar:2.3-ea:compile

      [DEBUG]       javax.transaction:jta:jar:1.1:compile

      [DEBUG]    org.sonatype.flexmojos:flexmojos-generator-constraints:jar:3.5.0:compile

      [DEBUG]    com.adobe.flex:compiler:pom:3.2.0.3958:compile

      [DEBUG]       com.adobe.flex.compiler:asc:jar:3.2.0.3958:compile

      [DEBUG]       com.adobe.flex.compiler:asdoc:jar:3.2.0.3958:compile

      [DEBUG]       com.adobe.flex.compiler:batik-awt-util:jar:3.2.0.3958:compile

      [DEBUG]       com.adobe.flex.compiler:batik-bridge:jar:3.2.0.3958:compile

      [DEBUG]       com.adobe.flex.compiler:batik-css:jar:3.2.0.3958:compile

      [DEBUG]       com.adobe.flex.compiler:batik-dom:jar:3.2.0.3958:compile

      [DEBUG]       com.adobe.flex.compiler:batik-ext:jar:3.2.0.3958:compile

      [DEBUG]       com.adobe.flex.compiler:batik-gvt:jar:3.2.0.3958:compile

      [DEBUG]       com.adobe.flex.compiler:batik-parser:jar:3.2.0.3958:compile

      [DEBUG]       com.adobe.flex.compiler:batik-script:jar:3.2.0.3958:compile

      [DEBUG]       com.adobe.flex.compiler:batik-svg-dom:jar:3.2.0.3958:compile

      [DEBUG]       com.adobe.flex.compiler:batik-svggen:jar:3.2.0.3958:compile

      [DEBUG]       com.adobe.flex.compiler:batik-transcoder:jar:3.2.0.3958:compile

      [DEBUG]       com.adobe.flex.compiler:batik-util:jar:3.2.0.3958:compile

      [DEBUG]       com.adobe.flex.compiler:batik-xml:jar:3.2.0.3958:compile

      [DEBUG]       com.adobe.flex.compiler:commons-collections:jar:3.2.0.3958:compile

      [DEBUG]       com.adobe.flex.compiler:commons-discovery:jar:3.2.0.3958:compile

      [DEBUG]       com.adobe.flex.compiler:commons-logging:jar:3.2.0.3958:compile

      [DEBUG]       com.adobe.flex.compiler:compc:jar:3.2.0.3958:compile

      [DEBUG]       com.adobe.flex.compiler:copylocale:jar:3.2.0.3958:compile

      [DEBUG]       com.adobe.flex.compiler:digest:jar:3.2.0.3958:compile

      [DEBUG]       com.adobe.flex.compiler:fcsh:jar:3.2.0.3958:compile

      [DEBUG]       com.adobe.flex.compiler:fdb:jar:3.2.0.3958:compile

      [DEBUG]       com.adobe.flex.compiler:flex-compiler-oem:jar:3.2.0.3958:compile

      [DEBUG]       com.adobe.flex.compiler:flex-messaging-common:jar:3.2.0.3958:compile

      [DEBUG]       com.adobe.flex.compiler:mm-velocity:jar:3.2.0.3958:compile

      [DEBUG]       com.adobe.flex.compiler:mxmlc:jar:3.2.0.3958:compile

      [DEBUG]       com.adobe.flex.compiler:optimizer:jar:3.2.0.3958:compile

      [DEBUG]       com.adobe.flex.compiler:swfutils:jar:3.2.0.3958:compile

      [DEBUG]       com.adobe.flex.compiler:xalan:jar:3.2.0.3958:compile

      [DEBUG]       com.adobe.flex.compiler:xercesImpl:jar:3.2.0.3958:compile

      [DEBUG]       com.adobe.flex.compiler:xercesPatch:jar:3.2.0.3958:compile

      [DEBUG]       com.adobe.flex.compiler:xmlParserAPIs:jar:3.2.0.3958:compile

      [DEBUG]    com.adobe.flex.compiler:asdoc:zip:template:3.2.0.3958:compile

      [DEBUG]    dom4j:dom4j:jar:1.6.1:compile

      [DEBUG]       xml-apis:xml-apis:jar:1.0.b2:compile

      [DEBUG]    org.apache.maven:maven-plugin-api:jar:2.0.9:compile

      [DEBUG]    org.apache.maven:maven-project:jar:2.0.9:compile

      [DEBUG]       org.apache.maven:maven-settings:jar:2.0.9:compile

      [DEBUG]       org.apache.maven:maven-profile:jar:2.0.9:compile

      [DEBUG]       org.apache.maven:maven-model:jar:2.0.9:compile

      [DEBUG]       org.apache.maven:maven-artifact-manager:jar:2.0.9:compile

      [DEBUG]       org.apache.maven:maven-plugin-registry:jar:2.0.9:compile

      [DEBUG]       org.codehaus.plexus:plexus-utils:jar:1.5.1:compile

      [DEBUG]       org.apache.maven:maven-artifact:jar:2.0.9:compile

      [DEBUG]    org.apache.maven:maven-core:jar:2.0.9:compile

      [DEBUG]       org.apache.maven:maven-plugin-parameter-documenter:jar:2.0.9:compile

      [DEBUG]       org.apache.maven.reporting:maven-reporting-api:jar:2.0.9:compile

      [DEBUG]          org.apache.maven.doxia:doxia-sink-api:jar:1.0-alpha-10:compile

      [DEBUG]       org.apache.maven:maven-repository-metadata:jar:2.0.9:compile

      [DEBUG]       org.apache.maven:maven-error-diagnostics:jar:2.0.9:compile

      [DEBUG]       commons-cli:commons-cli:jar:1.0:compile

      [DEBUG]       org.apache.maven:maven-plugin-descriptor:jar:2.0.9:compile

      [DEBUG]       org.codehaus.plexus:plexus-interactivity-api:jar:1.0-alpha-4:compile

      [DEBUG]       org.apache.maven:maven-monitor:jar:2.0.9:compile

      [DEBUG]       classworlds:classworlds:jar:1.1:compile

      [DEBUG]    jaxen:jaxen:jar:1.1:compile

      [DEBUG]       jdom:jdom:jar:1.0:compile

      [DEBUG]       xerces:xercesImpl:jar:2.6.2:compile

      [DEBUG]       xom:xom:jar:1.0:compile

      [DEBUG]          xerces:xmlParserAPIs:jar:2.6.2:compile

      [DEBUG]          xalan:xalan:jar:2.6.0:compile

      [DEBUG]          com.ibm.icu:icu4j:jar:2.6.1:compile

      [DEBUG]    org.graniteds:granite-generator:jar:1.1.0:compile

      [DEBUG]    org.apache.maven.plugins:maven-eclipse-plugin:jar:2.5:compile

      [DEBUG]       org.codehaus.plexus:plexus-archiver:jar:1.0-alpha-7:provided (scope managed from compile)

      [DEBUG]       org.codehaus.plexus:plexus-interactivity-jline:jar:1.0-alpha-5:compile

      [DEBUG]       org.apache.maven:maven-archiver:jar:2.2:compile

      [DEBUG]       org.codehaus.plexus:plexus-resources:jar:1.0-alpha-4:compile

      [DEBUG]       biz.aQute:bndlib:jar:0.0.145:compile

      [DEBUG]       org.apache.maven.shared:maven-osgi:jar:0.2.0:compile

      [DEBUG]       org.eclipse.core:resources:jar:3.3.0-v20070604:compile

      [DEBUG]    org.apache.maven.reporting:maven-reporting-impl:jar:2.0.2:compile

      [DEBUG]       commons-validator:commons-validator:jar:1.1.4:compile

      [DEBUG]       org.apache.maven.doxia:doxia-core:jar:1.0-alpha-7:compile

      [DEBUG]       oro:oro:jar:2.0.7:compile

      [DEBUG]       org.apache.maven.doxia:doxia-site-renderer:jar:1.0-alpha-7:compile

      [DEBUG]          org.codehaus.plexus:plexus-i18n:jar:1.0-beta-6:compile

      [DEBUG]          org.codehaus.plexus:plexus-velocity:jar:1.1.2:compile

      [DEBUG]             plexus:plexus-utils:jar:1.0.2:compile

      [DEBUG]             commons-collections:commons-collections:jar:2.0:compile

      [DEBUG]             velocity:velocity:jar:1.4:compile

      [DEBUG]                velocity:velocity-dep:jar:1.4:runtime

      [DEBUG]          org.apache.maven.doxia:doxia-decoration-model:jar:1.0-alpha-7:compile

      [DEBUG]    commons-lang:commons-lang:jar:2.4:compile

      [DEBUG]    commons-io:commons-io:jar:1.4:compile

      [DEBUG]    commons-httpclient:commons-httpclient:jar:3.1:compile

      [DEBUG]       commons-logging:commons-logging:jar:1.0.4:compile

      [DEBUG]       commons-codec:commons-codec:jar:1.3:compile (version managed from 1.2)

      [DEBUG]    org.apache.maven.plugins:maven-source-plugin:jar:2.0.4:compile

      [DEBUG]    de.java2html:java2html:jar:5.0:compile

      [DEBUG]    org.aspectj:aspectjrt:jar:1.6.5:compile

      [DEBUG]    eu.cedarsoft.utils:zip:jar:1.1:compile

      [DEBUG]       eu.cedarsoft:guice-annotations:jar:1.0:compile

      [DEBUG]       com.intellij:annotations:jar:6.0.3:compile

      [DEBUG]    org.codehaus.plexus:plexus-component-annotations:jar:1.0-beta-3.0.6:compile

      [DEBUG]    org.jvnet:animal-sniffer-annotation:jar:1.0:compile

      [DEBUG]    org.sonatype.flexmojos:flexmojos-tester:jar:3.5.0:compile

      [DEBUG]    net.sf.saxon:saxon-dom:jar:9.0:compile

      [DEBUG]    org.apache.maven.shared:maven-common-artifact-filters:jar:1.2:compile

      [DEBUG]       org.apache.maven.shared:maven-plugin-testing-harness:jar:1.1:compile

      [DEBUG] Verifying availability of /Users/erat/.m2/repository/com/adobe/flex/compiler/3.2.0.3958/compiler-3.2.0.3958.pom from [dist.codehaus.org (http://dist.codehaus.org, releases+snapshots), repository.codehaus.org (http://repository.codehaus.org, releases+snapshots), mc-release (http://mc-repo.googlecode.com/svn/maven2/releases, releases), central (http://repo1.maven.org/maven2, releases)]

      [DEBUG] Verifying availability of /Users/erat/.m2/repository/com/adobe/flex/compiler/asc/3.2.0.3958/asc-3.2.0.3958.jar from [dist.codehaus.org (http://dist.codehaus.org, releases+snapshots), repository.codehaus.org (http://repository.codehaus.org, releases+snapshots), mc-release (http://mc-repo.googlecode.com/svn/maven2/releases, releases), central (http://repo1.maven.org/maven2, releases)]

      [DEBUG] Verifying availability of /Users/erat/.m2/repository/com/adobe/flex/compiler/asdoc/3.2.0.3958/asdoc-3.2.0.3958.jar from [dist.codehaus.org (http://dist.codehaus.org, releases+snapshots), repository.codehaus.org (http://repository.codehaus.org, releases+snapshots), mc-release (http://mc-repo.googlecode.com/svn/maven2/releases, releases), central (http://repo1.maven.org/maven2, releases)]

      [DEBUG] Verifying availability of /Users/erat/.m2/repository/com/adobe/flex/compiler/batik-awt-util/3.2.0.3958/batik-awt-ut il-3.2.0.3958.jar from [dist.codehaus.org (http://dist.codehaus.org, releases+snapshots), repository.codehaus.org (http://repository.codehaus.org, releases+snapshots), mc-release (http://mc-repo.googlecode.com/svn/maven2/releases, releases), central (http://repo1.maven.org/maven2, releases)]

      [DEBUG] Verifying availability of /Users/erat/.m2/repository/com/adobe/flex/compiler/batik-bridge/3.2.0.3958/batik-bridge-3 .2.0.3958.jar from [dist.codehaus.org (http://dist.codehaus.org, releases+snapshots), repository.codehaus.org (http://repository.codehaus.org, releases+snapshots), mc-release (http://mc-repo.googlecode.com/svn/maven2/releases, releases), central (http://repo1.maven.org/maven2, releases)]

      [DEBUG] Verifying availability of /Users/erat/.m2/repository/com/adobe/flex/compiler/batik-css/3.2.0.3958/batik-css-3.2.0.3 958.jar from [dist.codehaus.org (http://dist.codehaus.org, releases+snapshots), repository.codehaus.org (http://repository.codehaus.org, releases+snapshots), mc-release (http://mc-repo.googlecode.com/svn/maven2/releases, releases), central (http://repo1.maven.org/maven2, releases)]

      [DEBUG] Verifying availability of /Users/erat/.m2/repository/com/adobe/flex/compiler/batik-dom/3.2.0.3958/batik-dom-3.2.0.3 958.jar from [dist.codehaus.org (http://dist.codehaus.org, releases+snapshots), repository.codehaus.org (http://repository.codehaus.org, releases+snapshots), mc-release (http://mc-repo.googlecode.com/svn/maven2/releases, releases), central (http://repo1.maven.org/maven2, releases)]

      [DEBUG] Verifying availability of /Users/erat/.m2/repository/com/adobe/flex/compiler/batik-ext/3.2.0.3958/batik-ext-3.2.0.3 958.jar from [dist.codehaus.org (http://dist.codehaus.org, releases+snapshots), repository.codehaus.org (http://repository.codehaus.org, releases+snapshots), mc-release (http://mc-repo.googlecode.com/svn/maven2/releases, releases), central (http://repo1.maven.org/maven2, releases)]

      [DEBUG] Verifying availability of /Users/erat/.m2/repository/com/adobe/flex/compiler/batik-gvt/3.2.0.3958/batik-gvt-3.2.0.3 958.jar from [dist.codehaus.org (http://dist.codehaus.org, releases+snapshots), repository.codehaus.org (http://repository.codehaus.org, releases+snapshots), mc-release (http://mc-repo.googlecode.com/svn/maven2/releases, releases), central (http://repo1.maven.org/maven2, releases)]

      [DEBUG] Verifying availability of /Users/erat/.m2/repository/com/adobe/flex/compiler/batik-parser/3.2.0.3958/batik-parser-3 .2.0.3958.jar from [dist.codehaus.org (http://dist.codehaus.org, releases+snapshots), repository.codehaus.org (http://repository.codehaus.org, releases+snapshots), mc-release (http://mc-repo.googlecode.com/svn/maven2/releases, releases), central (http://repo1.maven.org/maven2, releases)]

      [DEBUG] Verifying availability of /Users/erat/.m2/repository/com/adobe/flex/compiler/batik-script/3.2.0.3958/batik-script-3 .2.0.3958.jar from [dist.codehaus.org (http://dist.codehaus.org, releases+snapshots), repository.codehaus.org (http://repository.codehaus.org, releases+snapshots), mc-release (http://mc-repo.googlecode.com/svn/maven2/releases, releases), central (http://repo1.maven.org/maven2, releases)]

      [DEBUG] Verifying availability of /Users/erat/.m2/repository/com/adobe/flex/compiler/batik-svg-dom/3.2.0.3958/batik-svg-dom -3.2.0.3958.jar from [dist.codehaus.org (http://dist.codehaus.org, releases+snapshots), repository.codehaus.org (http://repository.codehaus.org, releases+snapshots), mc-release (http://mc-repo.googlecode.com/svn/maven2/releases, releases), central (http://repo1.maven.org/maven2, releases)]

      [DEBUG] Verifying availability of /Users/erat/.m2/repository/com/adobe/flex/compiler/batik-svggen/3.2.0.3958/batik-svggen-3 .2.0.3958.jar from [dist.codehaus.org (http://dist.codehaus.org, releases+snapshots), repository.codehaus.org (http://repository.codehaus.org, releases+snapshots), mc-release (http://mc-repo.googlecode.com/svn/maven2/releases, releases), central (http://repo1.maven.org/maven2, releases)]

      [DEBUG] Verifying availability of /Users/erat/.m2/repository/com/adobe/flex/compiler/batik-transcoder/3.2.0.3958/batik-tran scoder-3.2.0.3958.jar from [dist.codehaus.org (http://dist.codehaus.org, releases+snapshots), repository.codehaus.org (http://repository.codehaus.org, releases+snapshots), mc-release (http://mc-repo.googlecode.com/svn/maven2/releases, releases), central (http://repo1.maven.org/maven2, releases)]

      [DEBUG] Verifying availability of /Users/erat/.m2/repository/com/adobe/flex/compiler/batik-util/3.2.0.3958/batik-util-3.2.0 .3958.jar from [dist.codehaus.org (http://dist.codehaus.org, releases+snapshots), repository.codehaus.org (http://repository.codehaus.org, releases+snapshots), mc-release (http://mc-repo.googlecode.com/svn/maven2/releases, releases), central (http://repo1.maven.org/maven2, releases)]

      [DEBUG] Verifying availability of /Users/erat/.m2/repository/com/adobe/flex/compiler/batik-xml/3.2.0.3958/batik-xml-3.2.0.3 958.jar from [dist.codehaus.org (http://dist.codehaus.org, releases+snapshots), repository.codehaus.org (http://repository.codehaus.org, releases+snapshots), mc-release (http://mc-repo.googlecode.com/svn/maven2/releases, releases), central (http://repo1.maven.org/maven2, releases)]

      [DEBUG] Verifying availability of /Users/erat/.m2/repository/com/adobe/flex/compiler/commons-collections/3.2.0.3958/commons -collections-3.2.0.3958.jar from [dist.codehaus.org (http://dist.codehaus.org, releases+snapshots), repository.codehaus.org (http://repository.codehaus.org, releases+snapshots), mc-release (http://mc-repo.googlecode.com/svn/maven2/releases, releases), central (http://repo1.maven.org/maven2, releases)]

      [DEBUG] Verifying availability of /Users/erat/.m2/repository/com/adobe/flex/compiler/commons-discovery/3.2.0.3958/commons-d iscovery-3.2.0.3958.jar from [dist.codehaus.org (http://dist.codehaus.org, releases+snapshots), repository.codehaus.org (http://repository.codehaus.org, releases+snapshots), mc-release (http://mc-repo.googlecode.com/svn/maven2/releases, releases), central (http://repo1.maven.org/maven2, releases)]

      [DEBUG] Verifying availability of /Users/erat/.m2/repository/com/adobe/flex/compiler/commons-logging/3.2.0.3958/commons-log ging-3.2.0.3958.jar from [dist.codehaus.org (http://dist.codehaus.org, releases+snapshots), repository.codehaus.org (http://repository.codehaus.org, releases+snapshots), mc-release (http://mc-repo.googlecode.com/svn/maven2/releases, releases), central (http://repo1.maven.org/maven2, releases)]

      [DEBUG] Verifying availability of /Users/erat/.m2/repository/com/adobe/flex/compiler/compc/3.2.0.3958/compc-3.2.0.3958.jar from [dist.codehaus.org (http://dist.codehaus.org, releases+snapshots), repository.codehaus.org (http://repository.codehaus.org, releases+snapshots), mc-release (http://mc-repo.googlecode.com/svn/maven2/releases, releases), central (http://repo1.maven.org/maven2, releases)]

      [DEBUG] Verifying availability of /Users/erat/.m2/repository/com/adobe/flex/compiler/copylocale/3.2.0.3958/copylocale-3.2.0 .3958.jar from [dist.codehaus.org (http://dist.codehaus.org, releases+snapshots), repository.codehaus.org (http://repository.codehaus.org, releases+snapshots), mc-release (http://mc-repo.googlecode.com/svn/maven2/releases, releases), central (http://repo1.maven.org/maven2, releases)]

      [DEBUG] Verifying availability of /Users/erat/.m2/repository/com/adobe/flex/compiler/digest/3.2.0.3958/digest-3.2.0.3958.ja r from [dist.codehaus.org (http://dist.codehaus.org, releases+snapshots), repository.codehaus.org (http://repository.codehaus.org, releases+snapshots), mc-release (http://mc-repo.googlecode.com/svn/maven2/releases, releases), central (http://repo1.maven.org/maven2, releases)]

      [DEBUG] Verifying availability of /Users/erat/.m2/repository/com/adobe/flex/compiler/fcsh/3.2.0.3958/fcsh-3.2.0.3958.jar from [dist.codehaus.org (http://dist.codehaus.org, releases+snapshots), repository.codehaus.org (http://repository.codehaus.org, releases+snapshots), mc-release (http://mc-repo.googlecode.com/svn/maven2/releases, releases), central (http://repo1.maven.org/maven2, releases)]

      [DEBUG] Verifying availability of /Users/erat/.m2/repository/com/adobe/flex/compiler/fdb/3.2.0.3958/fdb-3.2.0.3958.jar from [dist.codehaus.org (http://dist.codehaus.org, releases+snapshots), repository.codehaus.org (http://repository.codehaus.org, releases+snapshots), mc-release (http://mc-repo.googlecode.com/svn/maven2/releases, releases), central (http://repo1.maven.org/maven2, releases)]

      [DEBUG] Verifying availability of /Users/erat/.m2/repository/com/adobe/flex/compiler/flex-compiler-oem/3.2.0.3958/flex-comp iler-oem-3.2.0.3958.jar from [dist.codehaus.org (http://dist.codehaus.org, releases+snapshots), repository.codehaus.org (http://repository.codehaus.org, releases+snapshots), mc-release (http://mc-repo.googlecode.com/svn/maven2/releases, releases), central (http://repo1.maven.org/maven2, releases)]

      [DEBUG] Verifying availability of /Users/erat/.m2/repository/com/adobe/flex/compiler/flex-messaging-common/3.2.0.3958/flex- messaging-common-3.2.0.3958.jar from [dist.codehaus.org (http://dist.codehaus.org, releases+snapshots), repository.codehaus.org (http://repository.codehaus.org, releases+snapshots), mc-release (http://mc-repo.googlecode.com/svn/maven2/releases, releases), central (http://repo1.maven.org/maven2, releases)]

      [DEBUG] Verifying availability of /Users/erat/.m2/repository/com/adobe/flex/compiler/mm-velocity/3.2.0.3958/mm-velocity-3.2 .0.3958.jar from [dist.codehaus.org (http://dist.codehaus.org, releases+snapshots), repository.codehaus.org (http://repository.codehaus.org, releases+snapshots), mc-release (http://mc-repo.googlecode.com/svn/maven2/releases, releases), central (http://repo1.maven.org/maven2, releases)]

      [DEBUG] Verifying availability of /Users/erat/.m2/repository/com/adobe/flex/compiler/mxmlc/3.2.0.3958/mxmlc-3.2.0.3958.jar from [dist.codehaus.org (http://dist.codehaus.org, releases+snapshots), repository.codehaus.org (http://repository.codehaus.org, releases+snapshots), mc-release (http://mc-repo.googlecode.com/svn/maven2/releases, releases), central (http://repo1.maven.org/maven2, releases)]

      [DEBUG] Verifying availability of /Users/erat/.m2/repository/com/adobe/flex/compiler/optimizer/3.2.0.3958/optimizer-3.2.0.3 958.jar from [dist.codehaus.org (http://dist.codehaus.org, releases+snapshots), repository.codehaus.org (http://repository.codehaus.org, releases+snapshots), mc-release (http://mc-repo.googlecode.com/svn/maven2/releases, releases), central (http://repo1.maven.org/maven2, releases)]

      [DEBUG] Verifying availability of /Users/erat/.m2/repository/com/adobe/flex/compiler/swfutils/3.2.0.3958/swfutils-3.2.0.395 8.jar from [dist.codehaus.org (http://dist.codehaus.org, releases+snapshots), repository.codehaus.org (http://repository.codehaus.org, releases+snapshots), mc-release (http://mc-repo.googlecode.com/svn/maven2/releases, releases), central (http://repo1.maven.org/maven2, releases)]

      [DEBUG] Verifying availability of /Users/erat/.m2/repository/com/adobe/flex/compiler/xalan/3.2.0.3958/xalan-3.2.0.3958.jar from [dist.codehaus.org (http://dist.codehaus.org, releases+snapshots), repository.codehaus.org (http://repository.codehaus.org, releases+snapshots), mc-release (http://mc-repo.googlecode.com/svn/maven2/releases, releases), central (http://repo1.maven.org/maven2, releases)]

      [DEBUG] Verifying availability of /Users/erat/.m2/repository/com/adobe/flex/compiler/xercesImpl/3.2.0.3958/xercesImpl-3.2.0 .3958.jar from [dist.codehaus.org (http://dist.codehaus.org, releases+snapshots), repository.codehaus.org (http://repository.codehaus.org, releases+snapshots), mc-release (http://mc-repo.googlecode.com/svn/maven2/releases, releases), central (http://repo1.maven.org/maven2, releases)]

      [DEBUG] Verifying availability of /Users/erat/.m2/repository/com/adobe/flex/compiler/xercesPatch/3.2.0.3958/xercesPatch-3.2 .0.3958.jar from [dist.codehaus.org (http://dist.codehaus.org, releases+snapshots), repository.codehaus.org (http://repository.codehaus.org, releases+snapshots), mc-release (http://mc-repo.googlecode.com/svn/maven2/releases, releases), central (http://repo1.maven.org/maven2, releases)]

      [DEBUG] Verifying availability of /Users/erat/.m2/repository/com/adobe/flex/compiler/xmlParserAPIs/3.2.0.3958/xmlParserAPIs -3.2.0.3958.jar from [dist.codehaus.org (http://dist.codehaus.org, releases+snapshots), repository.codehaus.org (http://repository.codehaus.org, releases+snapshots), mc-release (http://mc-repo.googlecode.com/svn/maven2/releases, releases), central (http://repo1.maven.org/maven2, releases)]

      [DEBUG] Verifying availability of /Users/erat/.m2/repository/com/adobe/flex/compiler/asdoc/3.2.0.3958/asdoc-3.2.0.3958-temp late.zip from [dist.codehaus.org (http://dist.codehaus.org, releases+snapshots), repository.codehaus.org (http://repository.codehaus.org, releases+snapshots), mc-release (http://mc-repo.googlecode.com/svn/maven2/releases, releases), central (http://repo1.maven.org/maven2, releases)]

      [DEBUG] Verifying availability of /Users/erat/.m2/repository/org/graniteds/granite-generator/1.1.0/granite-generator-1.1.0. jar from [dist.codehaus.org (http://dist.codehaus.org, releases+snapshots), repository.codehaus.org (http://repository.codehaus.org, releases+snapshots), mc-release (http://mc-repo.googlecode.com/svn/maven2/releases, releases), central (http://repo1.maven.org/maven2, releases)]

      [DEBUG] Verifying availability of /Users/erat/.m2/repository/net/sf/saxon/saxon-dom/9.0/saxon-dom-9.0.jar from [dist.codehaus.org (http://dist.codehaus.org, releases+snapshots), repository.codehaus.org (http://repository.codehaus.org, releases+snapshots), mc-release (http://mc-repo.googlecode.com/svn/maven2/releases, releases), central (http://repo1.maven.org/maven2, releases)]

      [DEBUG] Skipped remote update check for com.adobe.flex:compiler:pom:3.2.0.3958, locally cached artifact up-to-date.

      [DEBUG] Skipped remote update check for com.adobe.flex.compiler:asc:jar:3.2.0.3958, locally cached artifact up-to-date.

      [DEBUG] Skipped remote update check for com.adobe.flex.compiler:asdoc:jar:3.2.0.3958, locally cached artifact up-to-date.

      [DEBUG] Skipped remote update check for com.adobe.flex.compiler:batik-awt-util:jar:3.2.0.3958, locally cached artifact up-to-date.

      [DEBUG] Skipped remote update check for com.adobe.flex.compiler:batik-bridge:jar:3.2.0.3958, locally cached artifact up-to-date.

      [DEBUG] Skipped remote update check for com.adobe.flex.compiler:batik-css:jar:3.2.0.3958, locally cached artifact up-to-date.

      [DEBUG] Skipped remote update check for com.adobe.flex.compiler:batik-dom:jar:3.2.0.3958, locally cached artifact up-to-date.

      [DEBUG] Skipped remote update check for com.adobe.flex.compiler:batik-ext:jar:3.2.0.3958, locally cached artifact up-to-date.

      [DEBUG] Skipped remote update check for com.adobe.flex.compiler:batik-gvt:jar:3.2.0.3958, locally cached artifact up-to-date.

      [DEBUG] Skipped remote update check for com.adobe.flex.compiler:batik-parser:jar:3.2.0.3958, locally cached artifact up-to-date.

      [DEBUG] Skipped remote update check for com.adobe.flex.compiler:batik-script:jar:3.2.0.3958, locally cached artifact up-to-date.

      [DEBUG] Skipped remote update check for com.adobe.flex.compiler:batik-svg-dom:jar:3.2.0.3958, locally cached artifact up-to-date.

      [DEBUG] Skipped remote update check for com.adobe.flex.compiler:batik-svggen:jar:3.2.0.3958, locally cached artifact up-to-date.

      [DEBUG] Skipped remote update check for com.adobe.flex.compiler:batik-transcoder:jar:3.2.0.3958, locally cached artifact up-to-date.

      [DEBUG] Skipped remote update check for com.adobe.flex.compiler:batik-util:jar:3.2.0.3958, locally cached artifact up-to-date.

      [DEBUG] Skipped remote update check for com.adobe.flex.compiler:batik-xml:jar:3.2.0.3958, locally cached artifact up-to-date.

      [DEBUG] Skipped remote update check for com.adobe.flex.compiler:commons-collections:jar:3.2.0.3958, locally cached artifact up-to-date.

      [DEBUG] Skipped remote update check for com.adobe.flex.compiler:commons-discovery:jar:3.2.0.3958, locally cached artifact up-to-date.

      [DEBUG] Skipped remote update check for com.adobe.flex.compiler:commons-logging:jar:3.2.0.3958, locally cached artifact up-to-date.

      [DEBUG] Skipped remote update check for com.adobe.flex.compiler:compc:jar:3.2.0.3958, locally cached artifact up-to-date.

      [DEBUG] Skipped remote update check for com.adobe.flex.compiler:copylocale:jar:3.2.0.3958, locally cached artifact up-to-date.

      [DEBUG] Skipped remote update check for com.adobe.flex.compiler:digest:jar:3.2.0.3958, locally cached artifact up-to-date.

      [DEBUG] Skipped remote update check for com.adobe.flex.compiler:fcsh:jar:3.2.0.3958, locally cached artifact up-to-date.

      [DEBUG] Skipped remote update check for com.adobe.flex.compiler:fdb:jar:3.2.0.3958, locally cached artifact up-to-date.

      [DEBUG] Skipped remote update check for com.adobe.flex.compiler:flex-compiler-oem:jar:3.2.0.3958, locally cached artifact up-to-date.

      [DEBUG] Skipped remote update check for com.adobe.flex.compiler:flex-messaging-common:jar:3.2.0.3958, locally cached artifact up-to-date.

      [DEBUG] Skipped remote update check for com.adobe.flex.compiler:mm-velocity:jar:3.2.0.3958, locally cached artifact up-to-date.

      [DEBUG] Skipped remote update check for com.adobe.flex.compiler:mxmlc:jar:3.2.0.3958, locally cached artifact up-to-date.

      [DEBUG] Skipped remote update check for com.adobe.flex.compiler:optimizer:jar:3.2.0.3958, locally cached artifact up-to-date.

      [DEBUG] Skipped remote update check for com.adobe.flex.compiler:swfutils:jar:3.2.0.3958, locally cached artifact up-to-date.

      [DEBUG] Skipped remote update check for com.adobe.flex.compiler:xalan:jar:3.2.0.3958, locally cached artifact up-to-date.

      [DEBUG] Skipped remote update check for com.adobe.flex.compiler:xercesImpl:jar:3.2.0.3958, locally cached artifact up-to-date.

      [DEBUG] Skipped remote update check for com.adobe.flex.compiler:xercesPatch:jar:3.2.0.3958, locally cached artifact up-to-date.

      [DEBUG] Skipped remote update check for com.adobe.flex.compiler:xmlParserAPIs:jar:3.2.0.3958, locally cached artifact up-to-date.

      [DEBUG] Skipped remote update check for com.adobe.flex.compiler:asdoc:zip:template:3.2.0.3958, locally cached artifact up-to-date.

      [DEBUG] Skipped remote update check for org.graniteds:granite-generator:jar:1.1.0, locally cached artifact up-to-date.

      [DEBUG] Skipped remote update check for net.sf.saxon:saxon-dom:jar:9.0, locally cached artifact up-to-date.

      [DEBUG] Reading resolution tracking file /Users/erat/.m2/repository/com/adobe/flex/compiler/3.2.0.3958/compiler-3.2.0.3958.pom.las tUpdated

      [DEBUG] Writing resolution tracking file /Users/erat/.m2/repository/com/adobe/flex/compiler/3.2.0.3958/compiler-3.2.0.3958.pom.las tUpdated

      [DEBUG] Reading resolution tracking file /Users/erat/.m2/repository/com/adobe/flex/compiler/asc/3.2.0.3958/asc-3.2.0.3958.jar.last Updated

      [DEBUG] Writing resolution tracking file /Users/erat/.m2/repository/com/adobe/flex/compiler/asc/3.2.0.3958/asc-3.2.0.3958.jar.last Updated

      [DEBUG] Reading resolution tracking file /Users/erat/.m2/repository/com/adobe/flex/compiler/asdoc/3.2.0.3958/asdoc-3.2.0.3958.jar. lastUpdated

      [DEBUG] Writing resolution tracking file /Users/erat/.m2/repository/com/adobe/flex/compiler/asdoc/3.2.0.3958/asdoc-3.2.0.3958.jar. lastUpdated

      [DEBUG] Reading resolution tracking file /Users/erat/.m2/repository/com/adobe/flex/compiler/batik-awt-util/3.2.0.3958/batik-awt-ut il-3.2.0.3958.jar.lastUpdated

      [DEBUG] Writing resolution tracking file /Users/erat/.m2/repository/com/adobe/flex/compiler/batik-awt-util/3.2.0.3958/batik-awt-ut il-3.2.0.3958.jar.lastUpdated

      [DEBUG] Reading resolution tracking file /Users/erat/.m2/repository/com/adobe/flex/compiler/batik-bridge/3.2.0.3958/batik-bridge-3 .2.0.3958.jar.lastUpdated

      [DEBUG] Writing resolution tracking file /Users/erat/.m2/repository/com/adobe/flex/compiler/batik-bridge/3.2.0.3958/batik-bridge-3 .2.0.3958.jar.lastUpdated

      [DEBUG] Reading resolution tracking file /Users/erat/.m2/repository/com/adobe/flex/compiler/batik-css/3.2.0.3958/batik-css-3.2.0.3 958.jar.lastUpdated

      [DEBUG] Writing resolution tracking file /Users/erat/.m2/repository/com/adobe/flex/compiler/batik-css/3.2.0.3958/batik-css-3.2.0.3 958.jar.lastUpdated

      [DEBUG] Reading resolution tracking file /Users/erat/.m2/repository/com/adobe/flex/compiler/batik-dom/3.2.0.3958/batik-dom-3.2.0.3 958.jar.lastUpdated

      [DEBUG] Writing resolution tracking file /Users/erat/.m2/repository/com/adobe/flex/compiler/batik-dom/3.2.0.3958/batik-dom-3.2.0.3 958.jar.lastUpdated

      [DEBUG] Reading resolution tracking file /Users/erat/.m2/repository/com/adobe/flex/compiler/batik-ext/3.2.0.3958/batik-ext-3.2.0.3 958.jar.lastUpdated

      [DEBUG] Writing resolution tracking file /Users/erat/.m2/repository/com/adobe/flex/compiler/batik-ext/3.2.0.3958/batik-ext-3.2.0.3 958.jar.lastUpdated

      [DEBUG] Reading resolution tracking file /Users/erat/.m2/repository/com/adobe/flex/compiler/batik-gvt/3.2.0.3958/batik-gvt-3.2.0.3 958.jar.lastUpdated

      [DEBUG] Writing resolution tracking file /Users/erat/.m2/repository/com/adobe/flex/compiler/batik-gvt/3.2.0.3958/batik-gvt-3.2.0.3 958.jar.lastUpdated

      [DEBUG] Reading resolution tracking file /Users/erat/.m2/repository/com/adobe/flex/compiler/batik-parser/3.2.0.3958/batik-parser-3 .2.0.3958.jar.lastUpdated

      [DEBUG] Writing resolution tracking file /Users/erat/.m2/repository/com/adobe/flex/compiler/batik-parser/3.2.0.3958/batik-parser-3 .2.0.3958.jar.lastUpdated

      [DEBUG] Reading resolution tracking file /Users/erat/.m2/repository/com/adobe/flex/compiler/batik-script/3.2.0.3958/batik-script-3 .2.0.3958.jar.lastUpdated

      [DEBUG] Writing resolution tracking file /Users/erat/.m2/repository/com/adobe/flex/compiler/batik-script/3.2.0.3958/batik-script-3 .2.0.3958.jar.lastUpdated

      [DEBUG] Reading resolution tracking file /Users/erat/.m2/repository/com/adobe/flex/compiler/batik-svg-dom/3.2.0.3958/batik-svg-dom -3.2.0.3958.jar.lastUpdated

      [DEBUG] Writing resolution tracking file /Users/erat/.m2/repository/com/adobe/flex/compiler/batik-svg-dom/3.2.0.3958/batik-svg-dom -3.2.0.3958.jar.lastUpdated

      [DEBUG] Reading resolution tracking file /Users/erat/.m2/repository/com/adobe/flex/compiler/batik-svggen/3.2.0.3958/batik-svggen-3 .2.0.3958.jar.lastUpdated

      [DEBUG] Writing resolution tracking file /Users/erat/.m2/repository/com/adobe/flex/compiler/batik-svggen/3.2.0.3958/batik-svggen-3 .2.0.3958.jar.lastUpdated

      [DEBUG] Reading resolution tracking file /Users/erat/.m2/repository/com/adobe/flex/compiler/batik-transcoder/3.2.0.3958/batik-tran scoder-3.2.0.3958.jar.lastUpdated

      [DEBUG] Writing resolution tracking file /Users/erat/.m2/repository/com/adobe/flex/compiler/batik-transcoder/3.2.0.3958/batik-tran scoder-3.2.0.3958.jar.lastUpdated

      [DEBUG] Reading resolution tracking file /Users/erat/.m2/repository/com/adobe/flex/compiler/batik-util/3.2.0.3958/batik-util-3.2.0 .3958.jar.lastUpdated

      [DEBUG] Writing resolution tracking file /Users/erat/.m2/repository/com/adobe/flex/compiler/batik-util/3.2.0.3958/batik-util-3.2.0 .3958.jar.lastUpdated

      [DEBUG] Reading resolution tracking file /Users/erat/.m2/repository/com/adobe/flex/compiler/batik-xml/3.2.0.3958/batik-xml-3.2.0.3 958.jar.lastUpdated

      [DEBUG] Writing resolution tracking file /Users/erat/.m2/repository/com/adobe/flex/compiler/batik-xml/3.2.0.3958/batik-xml-3.2.0.3 958.jar.lastUpdated

      [DEBUG] Reading resolution tracking file /Users/erat/.m2/repository/com/adobe/flex/compiler/commons-collections/3.2.0.3958/commons -collections-3.2.0.3958.jar.lastUpdated

      [DEBUG] Writing resolution tracking file /Users/erat/.m2/repository/com/adobe/flex/compiler/commons-collections/3.2.0.3958/commons -collections-3.2.0.3958.jar.lastUpdated

      [DEBUG] Reading resolution tracking file /Users/erat/.m2/repository/com/adobe/flex/compiler/commons-discovery/3.2.0.3958/commons-d iscovery-3.2.0.3958.jar.lastUpdated

      [DEBUG] Writing resolution tracking file /Users/erat/.m2/repository/com/adobe/flex/compiler/commons-discovery/3.2.0.3958/commons-d iscovery-3.2.0.3958.jar.lastUpdated

      [DEBUG] Reading resolution tracking file /Users/erat/.m2/repository/com/adobe/flex/compiler/commons-logging/3.2.0.3958/commons-log ging-3.2.0.3958.jar.lastUpdated

      [DEBUG] Writing resolution tracking file /Users/erat/.m2/repository/com/adobe/flex/compiler/commons-logging/3.2.0.3958/commons-log ging-3.2.0.3958.jar.lastUpdated

      [DEBUG] Reading resolution tracking file /Users/erat/.m2/repository/com/adobe/flex/compiler/compc/3.2.0.3958/compc-3.2.0.3958.jar. lastUpdated

      [DEBUG] Writing resolution tracking file /Users/erat/.m2/repository/com/adobe/flex/compiler/compc/3.2.0.3958/compc-3.2.0.3958.jar. lastUpdated

      [DEBUG] Reading resolution tracking file /Users/erat/.m2/repository/com/adobe/flex/compiler/copylocale/3.2.0.3958/copylocale-3.2.0 .3958.jar.lastUpdated

      [DEBUG] Writing resolution tracking file /Users/erat/.m2/repository/com/adobe/flex/compiler/copylocale/3.2.0.3958/copylocale-3.2.0 .3958.jar.lastUpdated

      [DEBUG] Reading resolution tracking file /Users/erat/.m2/repository/com/adobe/flex/compiler/digest/3.2.0.3958/digest-3.2.0.3958.ja r.lastUpdated

      [DEBUG] Writing resolution tracking file /Users/erat/.m2/repository/com/adobe/flex/compiler/digest/3.2.0.3958/digest-3.2.0.3958.ja r.lastUpdated

      [DEBUG] Reading resolution tracking file /Users/erat/.m2/repository/com/adobe/flex/compiler/fcsh/3.2.0.3958/fcsh-3.2.0.3958.jar.la stUpdated

      [DEBUG] Writing resolution tracking file /Users/erat/.m2/repository/com/adobe/flex/compiler/fcsh/3.2.0.3958/fcsh-3.2.0.3958.jar.la stUpdated

      [DEBUG] Reading resolution tracking file /Users/erat/.m2/repository/com/adobe/flex/compiler/fdb/3.2.0.3958/fdb-3.2.0.3958.jar.last Updated

      [DEBUG] Writing resolution tracking file /Users/erat/.m2/repository/com/adobe/flex/compiler/fdb/3.2.0.3958/fdb-3.2.0.3958.jar.last Updated

      [DEBUG] Reading resolution tracking file /Users/erat/.m2/repository/com/adobe/flex/compiler/flex-compiler-oem/3.2.0.3958/flex-comp iler-oem-3.2.0.3958.jar.lastUpdated

      [DEBUG] Writing resolution tracking file /Users/erat/.m2/repository/com/adobe/flex/compiler/flex-compiler-oem/3.2.0.3958/flex-comp iler-oem-3.2.0.3958.jar.lastUpdated

      [DEBUG] Reading resolution tracking file /Users/erat/.m2/repository/com/adobe/flex/compiler/flex-messaging-common/3.2.0.3958/flex- messaging-common-3.2.0.3958.jar.lastUpdated

      [DEBUG] Writing resolution tracking file /Users/erat/.m2/repository/com/adobe/flex/compiler/flex-messaging-common/3.2.0.3958/flex- messaging-common-3.2.0.3958.jar.lastUpdated

      [DEBUG] Reading resolution tracking file /Users/erat/.m2/repository/com/adobe/flex/compiler/mm-velocity/3.2.0.3958/mm-velocity-3.2 .0.3958.jar.lastUpdated

      [DEBUG] Writing resolution tracking file /Users/erat/.m2/repository/com/adobe/flex/compiler/mm-velocity/3.2.0.3958/mm-velocity-3.2 .0.3958.jar.lastUpdated

      [DEBUG] Reading resolution tracking file /Users/erat/.m2/repository/com/adobe/flex/compiler/mxmlc/3.2.0.3958/mxmlc-3.2.0.3958.jar. lastUpdated

      [DEBUG] Writing resolution tracking file /Users/erat/.m2/repository/com/adobe/flex/compiler/mxmlc/3.2.0.3958/mxmlc-3.2.0.3958.jar. lastUpdated

      [DEBUG] Reading resolution tracking file /Users/erat/.m2/repository/com/adobe/flex/compiler/optimizer/3.2.0.3958/optimizer-3.2.0.3 958.jar.lastUpdated

      [DEBUG] Writing resolution tracking file /Users/erat/.m2/repository/com/adobe/flex/compiler/optimizer/3.2.0.3958/optimizer-3.2.0.3 958.jar.lastUpdated

      [DEBUG] Reading resolution tracking file /Users/erat/.m2/repository/com/adobe/flex/compiler/swfutils/3.2.0.3958/swfutils-3.2.0.395 8.jar.lastUpdated

      [DEBUG] Writing resolution tracking file /Users/erat/.m2/repository/com/adobe/flex/compiler/swfutils/3.2.0.3958/swfutils-3.2.0.395 8.jar.lastUpdated

      [DEBUG] Reading resolution tracking file /Users/erat/.m2/repository/com/adobe/flex/compiler/xalan/3.2.0.3958/xalan-3.2.0.3958.jar. lastUpdated

      [DEBUG] Writing resolution tracking file /Users/erat/.m2/repository/com/adobe/flex/compiler/xalan/3.2.0.3958/xalan-3.2.0.3958.jar. lastUpdated

      [DEBUG] Reading resolution tracking file /Users/erat/.m2/repository/com/adobe/flex/compiler/xercesImpl/3.2.0.3958/xercesImpl-3.2.0 .3958.jar.lastUpdated

      [DEBUG] Writing resolution tracking file /Users/erat/.m2/repository/com/adobe/flex/compiler/xercesImpl/3.2.0.3958/xercesImpl-3.2.0 .3958.jar.lastUpdated

      [DEBUG] Reading resolution tracking file /Users/erat/.m2/repository/com/adobe/flex/compiler/xercesPatch/3.2.0.3958/xercesPatch-3.2 .0.3958.jar.lastUpdated

      [DEBUG] Writing resolution tracking file /Users/erat/.m2/repository/com/adobe/flex/compiler/xercesPatch/3.2.0.3958/xercesPatch-3.2 .0.3958.jar.lastUpdated

      [DEBUG] Reading resolution tracking file /Users/erat/.m2/repository/com/adobe/flex/compiler/xmlParserAPIs/3.2.0.3958/xmlParserAPIs -3.2.0.3958.jar.lastUpdated

      [DEBUG] Writing resolution tracking file /Users/erat/.m2/repository/com/adobe/flex/compiler/xmlParserAPIs/3.2.0.3958/xmlParserAPIs -3.2.0.3958.jar.lastUpdated

      [DEBUG] Reading resolution tracking file /Users/erat/.m2/repository/com/adobe/flex/compiler/asdoc/3.2.0.3958/asdoc-3.2.0.3958-temp late.zip.lastUpdated

      [DEBUG] Writing resolution tracking file /Users/erat/.m2/repository/com/adobe/flex/compiler/asdoc/3.2.0.3958/asdoc-3.2.0.3958-temp late.zip.lastUpdated

      [DEBUG] Reading resolution tracking file /Users/erat/.m2/repository/org/graniteds/granite-generator/1.1.0/granite-generator-1.1.0. jar.lastUpdated

      [DEBUG] Writing resolution tracking file /Users/erat/.m2/repository/org/graniteds/granite-generator/1.1.0/granite-generator-1.1.0. jar.lastUpdated

      [DEBUG] Reading resolution tracking file /Users/erat/.m2/repository/net/sf/saxon/saxon-dom/9.0/saxon-dom-9.0.jar.lastUpdated

      [DEBUG] Writing resolution tracking file /Users/erat/.m2/repository/net/sf/saxon/saxon-dom/9.0/saxon-dom-9.0.jar.lastUpdated

      [DEBUG] Skipped remote update check for com.adobe.flex:compiler:pom:3.2.0.3958, locally cached artifact up-to-date.

      [DEBUG] Skipped remote update check for com.adobe.flex.compiler:asc:jar:3.2.0.3958, locally cached artifact up-to-date.

      [DEBUG] Skipped remote update check for com.adobe.flex.compiler:asdoc:jar:3.2.0.3958, locally cached artifact up-to-date.

      [DEBUG] Skipped remote update check for com.adobe.flex.compiler:batik-awt-util:jar:3.2.0.3958, locally cached artifact up-to-date.

      [DEBUG] Skipped remote update check for com.adobe.flex.compiler:batik-bridge:jar:3.2.0.3958, locally cached artifact up-to-date.

      [DEBUG] Skipped remote update check for com.adobe.flex.compiler:batik-css:jar:3.2.0.3958, locally cached artifact up-to-date.

      [DEBUG] Skipped remote update check for com.adobe.flex.compiler:batik-dom:jar:3.2.0.3958, locally cached artifact up-to-date.

      [DEBUG] Skipped remote update check for com.adobe.flex.compiler:batik-ext:jar:3.2.0.3958, locally cached artifact up-to-date.

      [DEBUG] Skipped remote update check for com.adobe.flex.compiler:batik-gvt:jar:3.2.0.3958, locally cached artifact up-to-date.

      [DEBUG] Skipped remote update check for com.adobe.flex.compiler:batik-parser:jar:3.2.0.3958, locally cached artifact up-to-date.

      [DEBUG] Skipped remote update check for com.adobe.flex.compiler:batik-script:jar:3.2.0.3958, locally cached artifact up-to-date.

      [DEBUG] Skipped remote update check for com.adobe.flex.compiler:batik-svg-dom:jar:3.2.0.3958, locally cached artifact up-to-date.

      [DEBUG] Skipped remote update check for com.adobe.flex.compiler:batik-svggen:jar:3.2.0.3958, locally cached artifact up-to-date.

      [DEBUG] Skipped remote update check for com.adobe.flex.compiler:batik-transcoder:jar:3.2.0.3958, locally cached artifact up-to-date.

      [DEBUG] Skipped remote update check for com.adobe.flex.compiler:batik-util:jar:3.2.0.3958, locally cached artifact up-to-date.

      [DEBUG] Skipped remote update check for com.adobe.flex.compiler:batik-xml:jar:3.2.0.3958, locally cached artifact up-to-date.

      [DEBUG] Skipped remote update check for com.adobe.flex.compiler:commons-collections:jar:3.2.0.3958, locally cached artifact up-to-date.

      [DEBUG] Skipped remote update check for com.adobe.flex.compiler:commons-discovery:jar:3.2.0.3958, locally cached artifact up-to-date.

      [DEBUG] Skipped remote update check for com.adobe.flex.compiler:commons-logging:jar:3.2.0.3958, locally cached artifact up-to-date.

      [DEBUG] Skipped remote update check for com.adobe.flex.compiler:compc:jar:3.2.0.3958, locally cached artifact up-to-date.

      [DEBUG] Skipped remote update check for com.adobe.flex.compiler:copylocale:jar:3.2.0.3958, locally cached artifact up-to-date.

      [DEBUG] Skipped remote update check for com.adobe.flex.compiler:digest:jar:3.2.0.3958, locally cached artifact up-to-date.

      [DEBUG] Skipped remote update check for com.adobe.flex.compiler:fcsh:jar:3.2.0.3958, locally cached artifact up-to-date.

      [DEBUG] Skipped remote update check for com.adobe.flex.compiler:fdb:jar:3.2.0.3958, locally cached artifact up-to-date.

      [DEBUG] Skipped remote update check for com.adobe.flex.compiler:flex-compiler-oem:jar:3.2.0.3958, locally cached artifact up-to-date.

      [DEBUG] Skipped remote update check for com.adobe.flex.compiler:flex-messaging-common:jar:3.2.0.3958, locally cached artifact up-to-date.

      [DEBUG] Skipped remote update check for com.adobe.flex.compiler:mm-velocity:jar:3.2.0.3958, locally cached artifact up-to-date.

      [DEBUG] Skipped remote update check for com.adobe.flex.compiler:mxmlc:jar:3.2.0.3958, locally cached artifact up-to-date.

      [DEBUG] Skipped remote update check for com.adobe.flex.compiler:optimizer:jar:3.2.0.3958, locally cached artifact up-to-date.

      [DEBUG] Skipped remote update check for com.adobe.flex.compiler:swfutils:jar:3.2.0.3958, locally cached artifact up-to-date.

      [DEBUG] Skipped remote update check for com.adobe.flex.compiler:xalan:jar:3.2.0.3958, locally cached artifact up-to-date.

      [DEBUG] Skipped remote update check for com.adobe.flex.compiler:xercesImpl:jar:3.2.0.3958, locally cached artifact up-to-date.

      [DEBUG] Skipped remote update check for com.adobe.flex.compiler:xercesPatch:jar:3.2.0.3958, locally cached artifact up-to-date.

      [DEBUG] Skipped remote update check for com.adobe.flex.compiler:xmlParserAPIs:jar:3.2.0.3958, locally cached artifact up-to-date.

      [DEBUG] Skipped remote update check for com.adobe.flex.compiler:asdoc:zip:template:3.2.0.3958, locally cached artifact up-to-date.

      [DEBUG] Skipped remote update check for org.graniteds:granite-generator:jar:1.1.0, locally cached artifact up-to-date.

      [DEBUG] Skipped remote update check for net.sf.saxon:saxon-dom:jar:9.0, locally cached artifact up-to-date.

      [DEBUG] Using connector WagonRepositoryConnector with priority 0 for http://repository.codehaus.org

      Downloading: http://repository.codehaus.org/com/adobe/flex/compiler/batik-awt-util/3.2.0.3958/batik-awt -util-3.2.0.3958.jar

      Downloading: http://repository.codehaus.org/com/adobe/flex/compiler/batik-bridge/3.2.0.3958/batik-bridg e-3.2.0.3958.jar

      Downloading: http://repository.codehaus.org/com/adobe/flex/compiler/3.2.0.3958/compiler-3.2.0.3958.pom

      Downloading: http://repository.codehaus.org/com/adobe/flex/compiler/asdoc/3.2.0.3958/asdoc-3.2.0.3958.j ar

      Downloading: http://repository.codehaus.org/com/adobe/flex/compiler/asc/3.2.0.3958/asc-3.2.0.3958.jar

      Downloading: http://repository.codehaus.org/com/adobe/flex/compiler/batik-css/3.2.0.3958/batik-css-3.2. 0.3958.jar

      Downloading: http://repository.codehaus.org/com/adobe/flex/compiler/batik-dom/3.2.0.3958/batik-dom-3.2. 0.3958.jar

      Downloading: http://repository.codehaus.org/com/adobe/flex/compiler/batik-ext/3.2.0.3958/batik-ext-3.2. 0.3958.jar

      Downloading: http://repository.codehaus.org/com/adobe/flex/compiler/batik-gvt/3.2.0.3958/batik-gvt-3.2. 0.3958.jar

      Downloading: http://repository.codehaus.org/com/adobe/flex/compiler/batik-parser/3.2.0.3958/batik-parse r-3.2.0.3958.jar

      Downloading: http://repository.codehaus.org/com/adobe/flex/compiler/batik-script/3.2.0.3958/batik-scrip t-3.2.0.3958.jar

      Downloading: http://repository.codehaus.org/com/adobe/flex/compiler/batik-svg-dom/3.2.0.3958/batik-svg- dom-3.2.0.3958.jar

      Downloading: http://repository.codehaus.org/com/adobe/flex/compiler/batik-svggen/3.2.0.3958/batik-svgge n-3.2.0.3958.jar

      Downloading: http://repository.codehaus.org/com/adobe/flex/compiler/batik-transcoder/3.2.0.3958/batik-t ranscoder-3.2.0.3958.jar

      Downloading: http://repository.codehaus.org/com/adobe/flex/compiler/batik-util/3.2.0.3958/batik-util-3. 2.0.3958.jar

      Downloading: http://repository.codehaus.org/com/adobe/flex/compiler/batik-xml/3.2.0.3958/batik-xml-3.2. 0.3958.jar

      Downloading: http://repository.codehaus.org/com/adobe/flex/compiler/commons-collections/3.2.0.3958/comm ons-collections-3.2.0.3958.jar

      Downloading: http://repository.codehaus.org/com/adobe/flex/compiler/commons-discovery/3.2.0.3958/common s-discovery-3.2.0.3958.jar

      Downloading: http://repository.codehaus.org/com/adobe/flex/compiler/commons-logging/3.2.0.3958/commons- logging-3.2.0.3958.jar

      Downloading: http://repository.codehaus.org/com/adobe/flex/compiler/compc/3.2.0.3958/compc-3.2.0.3958.j ar

      Downloading: http://repository.codehaus.org/com/adobe/flex/compiler/copylocale/3.2.0.3958/copylocale-3. 2.0.3958.jar

      Downloading: http://repository.codehaus.org/com/adobe/flex/compiler/digest/3.2.0.3958/digest-3.2.0.3958 .jar

      Downloading: http://repository.codehaus.org/com/adobe/flex/compiler/fcsh/3.2.0.3958/fcsh-3.2.0.3958.jar

      Downloading: http://repository.codehaus.org/com/adobe/flex/compiler/fdb/3.2.0.3958/fdb-3.2.0.3958.jar

      Downloading: http://repository.codehaus.org/com/adobe/flex/compiler/flex-compiler-oem/3.2.0.3958/flex-c ompiler-oem-3.2.0.3958.jar

      Downloading: http://repository.codehaus.org/com/adobe/flex/compiler/flex-messaging-common/3.2.0.3958/fl ex-messaging-common-3.2.0.3958.jar

      Downloading: http://repository.codehaus.org/com/adobe/flex/compiler/mm-velocity/3.2.0.3958/mm-velocity- 3.2.0.3958.jar

      Downloading: http://repository.codehaus.org/com/adobe/flex/compiler/mxmlc/3.2.0.3958/mxmlc-3.2.0.3958.j ar

      Downloading: http://repository.codehaus.org/com/adobe/flex/compiler/optimizer/3.2.0.3958/optimizer-3.2. 0.3958.jar

      Downloading: http://repository.codehaus.org/com/adobe/flex/compiler/swfutils/3.2.0.3958/swfutils-3.2.0. 3958.jar

      Downloading: http://repository.codehaus.org/com/adobe/flex/compiler/xalan/3.2.0.3958/xalan-3.2.0.3958.j ar

      Downloading: http://repository.codehaus.org/com/adobe/flex/compiler/xercesImpl/3.2.0.3958/xercesImpl-3. 2.0.3958.jar

      Downloading: http://repository.codehaus.org/com/adobe/flex/compiler/xercesPatch/3.2.0.3958/xercesPatch- 3.2.0.3958.jar

      Downloading: http://repository.codehaus.org/com/adobe/flex/compiler/xmlParserAPIs/3.2.0.3958/xmlParserA PIs-3.2.0.3958.jar

      Downloading: http://repository.codehaus.org/com/adobe/flex/compiler/asdoc/3.2.0.3958/asdoc-3.2.0.3958-t emplate.zip

      Downloading: http://repository.codehaus.org/org/graniteds/granite-generator/1.1.0/granite-generator-1.1 .0.jar

      Downloading: http://repository.codehaus.org/net/sf/saxon/saxon-dom/9.0/saxon-dom-9.0.jar

      [DEBUG] Reading resolution tracking file /Users/erat/.m2/repository/com/adobe/flex/compiler/3.2.0.3958/compiler-3.2.0.3958.pom.las tUpdated

      [DEBUG] Writing resolution tracking file /Users/erat/.m2/repository/com/adobe/flex/compiler/3.2.0.3958/compiler-3.2.0.3958.pom.las tUpdated

      [DEBUG] Reading resolution tracking file /Users/erat/.m2/repository/com/adobe/flex/compiler/asc/3.2.0.3958/asc-3.2.0.3958.jar.last Updated

      [DEBUG] Writing resolution tracking file /Users/erat/.m2/repository/com/adobe/flex/compiler/asc/3.2.0.3958/asc-3.2.0.3958.jar.last Updated

      [DEBUG] Reading resolution tracking file /Users/erat/.m2/repository/com/adobe/flex/compiler/asdoc/3.2.0.3958/asdoc-3.2.0.3958.jar. lastUpdated

      [DEBUG] Writing resolution tracking file /Users/erat/.m2/repository/com/adobe/flex/compiler/asdoc/3.2.0.3958/asdoc-3.2.0.3958.jar. lastUpdated

      [DEBUG] Reading resolution tracking file /Users/erat/.m2/repository/com/adobe/flex/compiler/batik-awt-util/3.2.0.3958/batik-awt-ut il-3.2.0.3958.jar.lastUpdated

      [DEBUG] Writing resolution tracking file /Users/erat/.m2/repository/com/adobe/flex/compiler/batik-awt-util/3.2.0.3958/batik-awt-ut il-3.2.0.3958.jar.lastUpdated

      [DEBUG] Reading resolution tracking file /Users/erat/.m2/repository/com/adobe/flex/compiler/batik-bridge/3.2.0.3958/batik-bridge-3 .2.0.3958.jar.lastUpdated

      [DEBUG] Writing resolution tracking file /Users/erat/.m2/repository/com/adobe/flex/compiler/batik-bridge/3.2.0.3958/batik-bridge-3 .2.0.3958.jar.lastUpdated

      [DEBUG] Reading resolution tracking file /Users/erat/.m2/repository/com/adobe/flex/compiler/batik-css/3.2.0.3958/batik-css-3.2.0.3 958.jar.lastUpdated

      [DEBUG] Writing resolution tracking file /Users/erat/.m2/repository/com/adobe/flex/compiler/batik-css/3.2.0.3958/batik-css-3.2.0.3 958.jar.lastUpdated

      [DEBUG] Reading resolution tracking file /Users/erat/.m2/repository/com/adobe/flex/compiler/batik-dom/3.2.0.3958/batik-dom-3.2.0.3 958.jar.lastUpdated

      [DEBUG] Writing resolution tracking file /Users/erat/.m2/repository/com/adobe/flex/compiler/batik-dom/3.2.0.3958/batik-dom-3.2.0.3 958.jar.lastUpdated

      [DEBUG] Reading resolution tracking file /Users/erat/.m2/repository/com/adobe/flex/compiler/batik-ext/3.2.0.3958/batik-ext-3.2.0.3 958.jar.lastUpdated

      [DEBUG] Writing resolution tracking file /Users/erat/.m2/repository/com/adobe/flex/compiler/batik-ext/3.2.0.3958/batik-ext-3.2.0.3 958.jar.lastUpdated

      [DEBUG] Reading resolution tracking file /Users/erat/.m2/repository/com/adobe/flex/compiler/batik-gvt/3.2.0.3958/batik-gvt-3.2.0.3 958.jar.lastUpdated

      [DEBUG] Writing resolution tracking file /Users/erat/.m2/repository/com/adobe/flex/compiler/batik-gvt/3.2.0.3958/batik-gvt-3.2.0.3 958.jar.lastUpdated

      [DEBUG] Reading resolution tracking file /Users/erat/.m2/repository/com/adobe/flex/compiler/batik-parser/3.2.0.3958/batik-parser-3 .2.0.3958.jar.lastUpdated

      [DEBUG] Writing resolution tracking file /Users/erat/.m2/repository/com/adobe/flex/compiler/batik-parser/3.2.0.3958/batik-parser-3 .2.0.3958.jar.lastUpdated

      [DEBUG] Reading resolution tracking file /Users/erat/.m2/repository/com/adobe/flex/compiler/batik-script/3.2.0.3958/batik-script-3 .2.0.3958.jar.lastUpdated

      [DEBUG] Writing resolution tracking file /Users/erat/.m2/repository/com/adobe/flex/compiler/batik-script/3.2.0.3958/batik-script-3 .2.0.3958.jar.lastUpdated

      [DEBUG] Reading resolution tracking file /Users/erat/.m2/repository/com/adobe/flex/compiler/batik-svg-dom/3.2.0.3958/batik-svg-dom -3.2.0.3958.jar.lastUpdated

      [DEBUG] Writing resolution tracking file /Users/erat/.m2/repository/com/adobe/flex/compiler/batik-svg-dom/3.2.0.3958/batik-svg-dom -3.2.0.3958.jar.lastUpdated

      [DEBUG] Reading resolution tracking file /Users/erat/.m2/repository/com/adobe/flex/compiler/batik-svggen/3.2.0.3958/batik-svggen-3 .2.0.3958.jar.lastUpdated

      [DEBUG] Writing resolution tracking file /Users/erat/.m2/repository/com/adobe/flex/compiler/batik-svggen/3.2.0.3958/batik-svggen-3 .2.0.3958.jar.lastUpdated

      [DEBUG] Reading resolution tracking file /Users/erat/.m2/repository/com/adobe/flex/compiler/batik-transcoder/3.2.0.3958/batik-tran scoder-3.2.0.3958.jar.lastUpdated

      [DEBUG] Writing resolution tracking file /Users/erat/.m2/repository/com/adobe/flex/compiler/batik-transcoder/3.2.0.3958/batik-tran scoder-3.2.0.3958.jar.lastUpdated

      [DEBUG] Reading resolution tracking file /Users/erat/.m2/repository/com/adobe/flex/compiler/batik-util/3.2.0.3958/batik-util-3.2.0 .3958.jar.lastUpdated

      [DEBUG] Writing resolution tracking file /Users/erat/.m2/repository/com/adobe/flex/compiler/batik-util/3.2.0.3958/batik-util-3.2.0 .3958.jar.lastUpdated

      [DEBUG] Reading resolution tracking file /Users/erat/.m2/repository/com/adobe/flex/compiler/batik-xml/3.2.0.3958/batik-xml-3.2.0.3 958.jar.lastUpdated

      [DEBUG] Writing resolution tracking file /Users/erat/.m2/repository/com/adobe/flex/compiler/batik-xml/3.2.0.3958/batik-xml-3.2.0.3 958.jar.lastUpdated

      [DEBUG] Reading resolution tracking file /Users/erat/.m2/repository/com/adobe/flex/compiler/commons-collections/3.2.0.3958/commons -collections-3.2.0.3958.jar.lastUpdated

      [DEBUG] Writing resolution tracking file /Users/erat/.m2/repository/com/adobe/flex/compiler/commons-collections/3.2.0.3958/commons -collections-3.2.0.3958.jar.lastUpdated

      [DEBUG] Reading resolution tracking file /Users/erat/.m2/repository/com/adobe/flex/compiler/commons-discovery/3.2.0.3958/commons-d iscovery-3.2.0.3958.jar.lastUpdated

      [DEBUG] Writing resolution tracking file /Users/erat/.m2/repository/com/adobe/flex/compiler/commons-discovery/3.2.0.3958/commons-d iscovery-3.2.0.3958.jar.lastUpdated

      [DEBUG] Reading resolution tracking file /Users/erat/.m2/repository/com/adobe/flex/compiler/commons-logging/3.2.0.3958/commons-log ging-3.2.0.3958.jar.lastUpdated

      [DEBUG] Writing resolution tracking file /Users/erat/.m2/repository/com/adobe/flex/compiler/commons-logging/3.2.0.3958/commons-log ging-3.2.0.3958.jar.lastUpdated

      [DEBUG] Reading resolution tracking file /Users/erat/.m2/repository/com/adobe/flex/compiler/compc/3.2.0.3958/compc-3.2.0.3958.jar. lastUpdated

      [DEBUG] Writing resolution tracking file /Users/erat/.m2/repository/com/adobe/flex/compiler/compc/3.2.0.3958/compc-3.2.0.3958.jar. lastUpdated

      [DEBUG] Reading resolution tracking file /Users/erat/.m2/repository/com/adobe/flex/compiler/copylocale/3.2.0.3958/copylocale-3.2.0 .3958.jar.lastUpdated

      [DEBUG] Writing resolution tracking file /Users/erat/.m2/repository/com/adobe/flex/compiler/copylocale/3.2.0.3958/copylocale-3.2.0 .3958.jar.lastUpdated

      [DEBUG] Reading resolution tracking file /Users/erat/.m2/repository/com/adobe/flex/compiler/digest/3.2.0.3958/digest-3.2.0.3958.ja r.lastUpdated

      [DEBUG] Writing resolution tracking file /Users/erat/.m2/repository/com/adobe/flex/compiler/digest/3.2.0.3958/digest-3.2.0.3958.ja r.lastUpdated

      [DEBUG] Reading resolution tracking file /Users/erat/.m2/repository/com/adobe/flex/compiler/fcsh/3.2.0.3958/fcsh-3.2.0.3958.jar.la stUpdated

      [DEBUG] Writing resolution tracking file /Users/erat/.m2/repository/com/adobe/flex/compiler/fcsh/3.2.0.3958/fcsh-3.2.0.3958.jar.la stUpdated

      [DEBUG] Reading resolution tracking file /Users/erat/.m2/repository/com/adobe/flex/compiler/fdb/3.2.0.3958/fdb-3.2.0.3958.jar.last Updated

      [DEBUG] Writing resolution tracking file /Users/erat/.m2/repository/com/adobe/flex/compiler/fdb/3.2.0.3958/fdb-3.2.0.3958.jar.last Updated

      [DEBUG] Reading resolution tracking file /Users/erat/.m2/repository/com/adobe/flex/compiler/flex-compiler-oem/3.2.0.3958/flex-comp iler-oem-3.2.0.3958.jar.lastUpdated

      [DEBUG] Writing resolution tracking file /Users/erat/.m2/repository/com/adobe/flex/compiler/flex-compiler-oem/3.2.0.3958/flex-comp iler-oem-3.2.0.3958.jar.lastUpdated

      [DEBUG] Reading resolution tracking file /Users/erat/.m2/repository/com/adobe/flex/compiler/flex-messaging-common/3.2.0.3958/flex- messaging-common-3.2.0.3958.jar.lastUpdated

      [DEBUG] Writing resolution tracking file /Users/erat/.m2/repository/com/adobe/flex/compiler/flex-messaging-common/3.2.0.3958/flex- messaging-common-3.2.0.3958.jar.lastUpdated

      [DEBUG] Reading resolution tracking file /Users/erat/.m2/repository/com/adobe/flex/compiler/mm-velocity/3.2.0.3958/mm-velocity-3.2 .0.3958.jar.lastUpdated

      [DEBUG] Writing resolution tracking file /Users/erat/.m2/repository/com/adobe/flex/compiler/mm-velocity/3.2.0.3958/mm-velocity-3.2 .0.3958.jar.lastUpdated

      [DEBUG] Reading resolution tracking file /Users/erat/.m2/repository/com/adobe/flex/compiler/mxmlc/3.2.0.3958/mxmlc-3.2.0.3958.jar. lastUpdated

      [DEBUG] Writing resolution tracking file /Users/erat/.m2/repository/com/adobe/flex/compiler/mxmlc/3.2.0.3958/mxmlc-3.2.0.3958.jar. lastUpdated

      [DEBUG] Reading resolution tracking file /Users/erat/.m2/repository/com/adobe/flex/compiler/optimizer/3.2.0.3958/optimizer-3.2.0.3 958.jar.lastUpdated

      [DEBUG] Writing resolution tracking file /Users/erat/.m2/repository/com/adobe/flex/compiler/optimizer/3.2.0.3958/optimizer-3.2.0.3 958.jar.lastUpdated

      [DEBUG] Reading resolution tracking file /Users/erat/.m2/repository/com/adobe/flex/compiler/swfutils/3.2.0.3958/swfutils-3.2.0.395 8.jar.lastUpdated

      [DEBUG] Writing resolution tracking file /Users/erat/.m2/repository/com/adobe/flex/compiler/swfutils/3.2.0.3958/swfutils-3.2.0.395 8.jar.lastUpdated

      [DEBUG] Reading resolution tracking file /Users/erat/.m2/repository/com/adobe/flex/compiler/xalan/3.2.0.3958/xalan-3.2.0.3958.jar. lastUpdated

      [DEBUG] Writing resolution tracking file /Users/erat/.m2/repository/com/adobe/flex/compiler/xalan/3.2.0.3958/xalan-3.2.0.3958.jar. lastUpdated

      [DEBUG] Reading resolution tracking file /Users/erat/.m2/repository/com/adobe/flex/compiler/xercesImpl/3.2.0.3958/xercesImpl-3.2.0 .3958.jar.lastUpdated

      [DEBUG] Writing resolution tracking file /Users/erat/.m2/repository/com/adobe/flex/compiler/xercesImpl/3.2.0.3958/xercesImpl-3.2.0 .3958.jar.lastUpdated

      [DEBUG] Reading resolution tracking file /Users/erat/.m2/repository/com/adobe/flex/compiler/xercesPatch/3.2.0.3958/xercesPatch-3.2 .0.3958.jar.lastUpdated

      [DEBUG] Writing resolution tracking file /Users/erat/.m2/repository/com/adobe/flex/compiler/xercesPatch/3.2.0.3958/xercesPatch-3.2 .0.3958.jar.lastUpdated

      [DEBUG] Reading resolution tracking file /Users/erat/.m2/repository/com/adobe/flex/compiler/xmlParserAPIs/3.2.0.3958/xmlParserAPIs -3.2.0.3958.jar.lastUpdated

      [DEBUG] Writing resolution tracking file /Users/erat/.m2/repository/com/adobe/flex/compiler/xmlParserAPIs/3.2.0.3958/xmlParserAPIs -3.2.0.3958.jar.lastUpdated

      [DEBUG] Reading resolution tracking file /Users/erat/.m2/repository/com/adobe/flex/compiler/asdoc/3.2.0.3958/asdoc-3.2.0.3958-temp late.zip.lastUpdated

      [DEBUG] Writing resolution tracking file /Users/erat/.m2/repository/com/adobe/flex/compiler/asdoc/3.2.0.3958/asdoc-3.2.0.3958-temp late.zip.lastUpdated

      [DEBUG] Reading resolution tracking file /Users/erat/.m2/repository/org/graniteds/granite-generator/1.1.0/granite-generator-1.1.0. jar.lastUpdated

      [DEBUG] Writing resolution tracking file /Users/erat/.m2/repository/org/graniteds/granite-generator/1.1.0/granite-generator-1.1.0. jar.lastUpdated

      [DEBUG] Reading resolution tracking file /Users/erat/.m2/repository/net/sf/saxon/saxon-dom/9.0/saxon-dom-9.0.jar.lastUpdated

      [DEBUG] Writing resolution tracking file /Users/erat/.m2/repository/net/sf/saxon/saxon-dom/9.0/saxon-dom-9.0.jar.lastUpdated

      [DEBUG] Skipped remote update check for com.adobe.flex:compiler:pom:3.2.0.3958, locally cached artifact up-to-date.

      [DEBUG] Skipped remote update check for com.adobe.flex.compiler:asc:jar:3.2.0.3958, locally cached artifact up-to-date.

      [DEBUG] Skipped remote update check for com.adobe.flex.compiler:asdoc:jar:3.2.0.3958, locally cached artifact up-to-date.

      [DEBUG] Skipped remote update check for com.adobe.flex.compiler:batik-awt-util:jar:3.2.0.3958, locally cached artifact up-to-date.

      [DEBUG] Skipped remote update check for com.adobe.flex.compiler:batik-bridge:jar:3.2.0.3958, locally cached artifact up-to-date.

      [DEBUG] Skipped remote update check for com.adobe.flex.compiler:batik-css:jar:3.2.0.3958, locally cached artifact up-to-date.

      [DEBUG] Skipped remote update check for com.adobe.flex.compiler:batik-dom:jar:3.2.0.3958, locally cached artifact up-to-date.

      [DEBUG] Skipped remote update check for com.adobe.flex.compiler:batik-ext:jar:3.2.0.3958, locally cached artifact up-to-date.

      [DEBUG] Skipped remote update check for com.adobe.flex.compiler:batik-gvt:jar:3.2.0.3958, locally cached artifact up-to-date.

      [DEBUG] Skipped remote update check for com.adobe.flex.compiler:batik-parser:jar:3.2.0.3958, locally cached artifact up-to-date.

      [DEBUG] Skipped remote update check for com.adobe.flex.compiler:batik-script:jar:3.2.0.3958, locally cached artifact up-to-date.

      [DEBUG] Skipped remote update check for com.adobe.flex.compiler:batik-svg-dom:jar:3.2.0.3958, locally cached artifact up-to-date.

      [DEBUG] Skipped remote update check for com.adobe.flex.compiler:batik-svggen:jar:3.2.0.3958, locally cached artifact up-to-date.

      [DEBUG] Skipped remote update check for com.adobe.flex.compiler:batik-transcoder:jar:3.2.0.3958, locally cached artifact up-to-date.

      [DEBUG] Skipped remote update check for com.adobe.flex.compiler:batik-util:jar:3.2.0.3958, locally cached artifact up-to-date.

      [DEBUG] Skipped remote update check for com.adobe.flex.compiler:batik-xml:jar:3.2.0.3958, locally cached artifact up-to-date.

      [DEBUG] Skipped remote update check for com.adobe.flex.compiler:commons-collections:jar:3.2.0.3958, locally cached artifact up-to-date.

      [DEBUG] Skipped remote update check for com.adobe.flex.compiler:commons-discovery:jar:3.2.0.3958, locally cached artifact up-to-date.

      [DEBUG] Skipped remote update check for com.adobe.flex.compiler:commons-logging:jar:3.2.0.3958, locally cached artifact up-to-date.

      [DEBUG] Skipped remote update check for com.adobe.flex.compiler:compc:jar:3.2.0.3958, locally cached artifact up-to-date.

      [DEBUG] Skipped remote update check for com.adobe.flex.compiler:copylocale:jar:3.2.0.3958, locally cached artifact up-to-date.

      [DEBUG] Skipped remote update check for com.adobe.flex.compiler:digest:jar:3.2.0.3958, locally cached artifact up-to-date.

      [DEBUG] Skipped remote update check for com.adobe.flex.compiler:fcsh:jar:3.2.0.3958, locally cached artifact up-to-date.

      [DEBUG] Skipped remote update check for com.adobe.flex.compiler:fdb:jar:3.2.0.3958, locally cached artifact up-to-date.

      [DEBUG] Skipped remote update check for com.adobe.flex.compiler:flex-compiler-oem:jar:3.2.0.3958, locally cached artifact up-to-date.

      [DEBUG] Skipped remote update check for com.adobe.flex.compiler:flex-messaging-common:jar:3.2.0.3958, locally cached artifact up-to-date.

      [DEBUG] Skipped remote update check for com.adobe.flex.compiler:mm-velocity:jar:3.2.0.3958, locally cached artifact up-to-date.

      [DEBUG] Skipped remote update check for com.adobe.flex.compiler:mxmlc:jar:3.2.0.3958, locally cached artifact up-to-date.

      [DEBUG] Skipped remote update check for com.adobe.flex.compiler:optimizer:jar:3.2.0.3958, locally cached artifact up-to-date.

      [DEBUG] Skipped remote update check for com.adobe.flex.compiler:swfutils:jar:3.2.0.3958, locally cached artifact up-to-date.

      [DEBUG] Skipped remote update check for com.adobe.flex.compiler:xalan:jar:3.2.0.3958, locally cached artifact up-to-date.

      [DEBUG] Skipped remote update check for com.adobe.flex.compiler:xercesImpl:jar:3.2.0.3958, locally cached artifact up-to-date.

      [DEBUG] Skipped remote update check for com.adobe.flex.compiler:xercesPatch:jar:3.2.0.3958, locally cached artifact up-to-date.

      [DEBUG] Skipped remote update check for com.adobe.flex.compiler:xmlParserAPIs:jar:3.2.0.3958, locally cached artifact up-to-date.

      [DEBUG] Skipped remote update check for com.adobe.flex.compiler:asdoc:zip:template:3.2.0.3958, locally cached artifact up-to-date.

      [DEBUG] Skipped remote update check for org.graniteds:granite-generator:jar:1.1.0, locally cached artifact up-to-date.

      [DEBUG] Skipped remote update check for net.sf.saxon:saxon-dom:jar:9.0, locally cached artifact up-to-date.

      [DEBUG] Using connector WagonRepositoryConnector with priority 0 for http://mc-repo.googlecode.com/svn/maven2/releases

      Downloading: http://mc-repo.googlecode.com/svn/maven2/releases/com/adobe/flex/compiler/3.2.0.3958/compi ler-3.2.0.3958.pom

      Downloading: http://mc-repo.googlecode.com/svn/maven2/releases/com/adobe/flex/compiler/asc/3.2.0.3958/a sc-3.2.0.3958.jar

      Downloading: http://mc-repo.googlecode.com/svn/maven2/releases/com/adobe/flex/compiler/asdoc/3.2.0.3958 /asdoc-3.2.0.3958.jar

      Downloading: http://mc-repo.googlecode.com/svn/maven2/releases/com/adobe/flex/compiler/batik-awt-util/3 .2.0.3958/batik-awt-util-3.2.0.3958.jar

      Downloading: http://mc-repo.googlecode.com/svn/maven2/releases/com/adobe/flex/compiler/batik-bridge/3.2 .0.3958/batik-bridge-3.2.0.3958.jar

      Downloading: http://mc-repo.googlecode.com/svn/maven2/releases/com/adobe/flex/compiler/batik-css/3.2.0. 3958/batik-css-3.2.0.3958.jar

      Downloading: http://mc-repo.googlecode.com/svn/maven2/releases/com/adobe/flex/compiler/batik-dom/3.2.0. 3958/batik-dom-3.2.0.3958.jar

      Downloading: http://mc-repo.googlecode.com/svn/maven2/releases/com/adobe/flex/compiler/batik-ext/3.2.0. 3958/batik-ext-3.2.0.3958.jar

      Downloading: http://mc-repo.googlecode.com/svn/maven2/releases/com/adobe/flex/compiler/batik-gvt/3.2.0. 3958/batik-gvt-3.2.0.3958.jar

      Downloading: http://mc-repo.googlecode.com/svn/maven2/releases/com/adobe/flex/compiler/batik-parser/3.2 .0.3958/batik-parser-3.2.0.3958.jar

      Downloading: http://mc-repo.googlecode.com/svn/maven2/releases/com/adobe/flex/compiler/batik-script/3.2 .0.3958/batik-script-3.2.0.3958.jar

      Downloading: http://mc-repo.googlecode.com/svn/maven2/releases/com/adobe/flex/compiler/batik-svg-dom/3. 2.0.3958/batik-svg-dom-3.2.0.3958.jar

      Downloading: http://mc-repo.googlecode.com/svn/maven2/releases/com/adobe/flex/compiler/batik-svggen/3.2 .0.3958/batik-svggen-3.2.0.3958.jar

      Downloading: http://mc-repo.googlecode.com/svn/maven2/releases/com/adobe/flex/compiler/batik-transcoder /3.2.0.3958/batik-transcoder-3.2.0.3958.jar

      Downloading: http://mc-repo.googlecode.com/svn/maven2/releases/com/adobe/flex/compiler/batik-util/3.2.0 .3958/batik-util-3.2.0.3958.jar

      Downloading: http://mc-repo.googlecode.com/svn/maven2/releases/com/adobe/flex/compiler/batik-xml/3.2.0. 3958/batik-xml-3.2.0.3958.jar

      Downloading: http://mc-repo.googlecode.com/svn/maven2/releases/com/adobe/flex/compiler/commons-collecti ons/3.2.0.3958/commons-collections-3.2.0.3958.jar

      Downloading: http://mc-repo.googlecode.com/svn/maven2/releases/com/adobe/flex/compiler/commons-logging/ 3.2.0.3958/commons-logging-3.2.0.3958.jar

      Downloading: http://mc-repo.googlecode.com/svn/maven2/releases/com/adobe/flex/compiler/commons-discover y/3.2.0.3958/commons-discovery-3.2.0.3958.jar

      Downloading: http://mc-repo.googlecode.com/svn/maven2/releases/com/adobe/flex/compiler/compc/3.2.0.3958 /compc-3.2.0.3958.jar

      Downloading: http://mc-repo.googlecode.com/svn/maven2/releases/com/adobe/flex/compiler/copylocale/3.2.0 .3958/copylocale-3.2.0.3958.jar

      Downloading: http://mc-repo.googlecode.com/svn/maven2/releases/com/adobe/flex/compiler/digest/3.2.0.395 8/digest-3.2.0.3958.jar

      Downloading: http://mc-repo.googlecode.com/svn/maven2/releases/com/adobe/flex/compiler/fcsh/3.2.0.3958/ fcsh-3.2.0.3958.jar

      Downloading: http://mc-repo.googlecode.com/svn/maven2/releases/com/adobe/flex/compiler/fdb/3.2.0.3958/f db-3.2.0.3958.jar

      Downloading: http://mc-repo.googlecode.com/svn/maven2/releases/com/adobe/flex/compiler/flex-compiler-oe m/3.2.0.3958/flex-compiler-oem-3.2.0.3958.jar

      Downloading: http://mc-repo.googlecode.com/svn/maven2/releases/com/adobe/flex/compiler/flex-messaging-c ommon/3.2.0.3958/flex-messaging-common-3.2.0.3958.jar

      Downloading: http://mc-repo.googlecode.com/svn/maven2/releases/com/adobe/flex/compiler/mm-velocity/3.2. 0.3958/mm-velocity-3.2.0.3958.jar

      Downloading: http://mc-repo.googlecode.com/svn/maven2/releases/com/adobe/flex/compiler/mxmlc/3.2.0.3958 /mxmlc-3.2.0.3958.jar

      Downloading: http://mc-repo.googlecode.com/svn/maven2/releases/com/adobe/flex/compiler/optimizer/3.2.0. 3958/optimizer-3.2.0.3958.jar

      Downloading: http://mc-repo.googlecode.com/svn/maven2/releases/com/adobe/flex/compiler/swfutils/3.2.0.3 958/swfutils-3.2.0.3958.jar

      Downloading: http://mc-repo.googlecode.com/svn/maven2/releases/com/adobe/flex/compiler/xalan/3.2.0.3958 /xalan-3.2.0.3958.jar

      Downloading: http://mc-repo.googlecode.com/svn/maven2/releases/com/adobe/flex/compiler/xercesImpl/3.2.0 .3958/xercesImpl-3.2.0.3958.jar

      Downloading: http://mc-repo.googlecode.com/svn/maven2/releases/com/adobe/flex/compiler/xmlParserAPIs/3. 2.0.3958/xmlParserAPIs-3.2.0.3958.jar

      Downloading: http://mc-repo.googlecode.com/svn/maven2/releases/com/adobe/flex/compiler/xercesPatch/3.2. 0.3958/xercesPatch-3.2.0.3958.jar

      Downloading: http://mc-repo.googlecode.com/svn/maven2/releases/com/adobe/flex/compiler/asdoc/3.2.0.3958 /asdoc-3.2.0.3958-template.zip

      Downloading: http://mc-repo.googlecode.com/svn/maven2/releases/org/graniteds/granite-generator/1.1.0/gr anite-generator-1.1.0.jar

      Downloading: http://mc-repo.googlecode.com/svn/maven2/releases/net/sf/saxon/saxon-dom/9.0/saxon-dom-9.0 .jar

      [DEBUG] Reading resolution tracking file /Users/erat/.m2/repository/com/adobe/flex/compiler/3.2.0.3958/compiler-3.2.0.3958.pom.las tUpdated

      [DEBUG] Writing resolution tracking file /Users/erat/.m2/repository/com/adobe/flex/compiler/3.2.0.3958/compiler-3.2.0.3958.pom.las tUpdated

      [DEBUG] Reading resolution tracking file /Users/erat/.m2/repository/com/adobe/flex/compiler/asc/3.2.0.3958/asc-3.2.0.3958.jar.last Updated

      [DEBUG] Writing resolution tracking file /Users/erat/.m2/repository/com/adobe/flex/compiler/asc/3.2.0.3958/asc-3.2.0.3958.jar.last Updated

      [DEBUG] Reading resolution tracking file /Users/erat/.m2/repository/com/adobe/flex/compiler/asdoc/3.2.0.3958/asdoc-3.2.0.3958.jar. lastUpdated

      [DEBUG] Writing resolution tracking file /Users/erat/.m2/repository/com/adobe/flex/compiler/asdoc/3.2.0.3958/asdoc-3.2.0.3958.jar. lastUpdated

      [DEBUG] Reading resolution tracking file /Users/erat/.m2/repository/com/adobe/flex/compiler/batik-awt-util/3.2.0.3958/batik-awt-ut il-3.2.0.3958.jar.lastUpdated

      [DEBUG] Writing resolution tracking file /Users/erat/.m2/repository/com/adobe/flex/compiler/batik-awt-util/3.2.0.3958/batik-awt-ut il-3.2.0.3958.jar.lastUpdated

      [DEBUG] Reading resolution tracking file /Users/erat/.m2/repository/com/adobe/flex/compiler/batik-bridge/3.2.0.3958/batik-bridge-3 .2.0.3958.jar.lastUpdated

      [DEBUG] Writing resolution tracking file /Users/erat/.m2/repository/com/adobe/flex/compiler/batik-bridge/3.2.0.3958/batik-bridge-3 .2.0.3958.jar.lastUpdated

      [DEBUG] Reading resolution tracking file /Users/erat/.m2/repository/com/adobe/flex/compiler/batik-css/3.2.0.3958/batik-css-3.2.0.3 958.jar.lastUpdated

      [DEBUG] Writing resolution tracking file /Users/erat/.m2/repository/com/adobe/flex/compiler/batik-css/3.2.0.3958/batik-css-3.2.0.3 958.jar.lastUpdated

      [DEBUG] Reading resolution tracking file /Users/erat/.m2/repository/com/adobe/flex/compiler/batik-dom/3.2.0.3958/batik-dom-3.2.0.3 958.jar.lastUpdated

      [DEBUG] Writing resolution tracking file /Users/erat/.m2/repository/com/adobe/flex/compiler/batik-dom/3.2.0.3958/batik-dom-3.2.0.3 958.jar.lastUpdated

      [DEBUG] Reading resolution tracking file /Users/erat/.m2/repository/com/adobe/flex/compiler/batik-ext/3.2.0.3958/batik-ext-3.2.0.3 958.jar.lastUpdated

      [DEBUG] Writing resolution tracking file /Users/erat/.m2/repository/com/adobe/flex/compiler/batik-ext/3.2.0.3958/batik-ext-3.2.0.3 958.jar.lastUpdated

      [DEBUG] Reading resolution tracking file /Users/erat/.m2/repository/com/adobe/flex/compiler/batik-gvt/3.2.0.3958/batik-gvt-3.2.0.3 958.jar.lastUpdated

      [DEBUG] Writing resolution tracking file /Users/erat/.m2/repository/com/adobe/flex/compiler/batik-gvt/3.2.0.3958/batik-gvt-3.2.0.3 958.jar.lastUpdated

      [DEBUG] Reading resolution tracking file /Users/erat/.m2/repository/com/adobe/flex/compiler/batik-parser/3.2.0.3958/batik-parser-3 .2.0.3958.jar.lastUpdated

      [DEBUG] Writing resolution tracking file /Users/erat/.m2/repository/com/adobe/flex/compiler/batik-parser/3.2.0.3958/batik-parser-3 .2.0.3958.jar.lastUpdated

      [DEBUG] Reading resolution tracking file /Users/erat/.m2/repository/com/adobe/flex/compiler/batik-script/3.2.0.3958/batik-script-3 .2.0.3958.jar.lastUpdated

      [DEBUG] Writing resolution tracking file /Users/erat/.m2/repository/com/adobe/flex/compiler/batik-script/3.2.0.3958/batik-script-3 .2.0.3958.jar.lastUpdated

      [DEBUG] Reading resolution tracking file /Users/erat/.m2/repository/com/adobe/flex/compiler/batik-svg-dom/3.2.0.3958/batik-svg-dom -3.2.0.3958.jar.lastUpdated

      [DEBUG] Writing resolution tracking file /Users/erat/.m2/repository/com/adobe/flex/compiler/batik-svg-dom/3.2.0.3958/batik-svg-dom -3.2.0.3958.jar.lastUpdated

      [DEBUG] Reading resolution tracking file /Users/erat/.m2/repository/com/adobe/flex/compiler/batik-svggen/3.2.0.3958/batik-svggen-3 .2.0.3958.jar.lastUpdated

      [DEBUG] Writing resolution tracking file /Users/erat/.m2/repository/com/adobe/flex/compiler/batik-svggen/3.2.0.3958/batik-svggen-3 .2.0.3958.jar.lastUpdated

      [DEBUG] Reading resolution tracking file /Users/erat/.m2/repository/com/adobe/flex/compiler/batik-transcoder/3.2.0.3958/batik-tran scoder-3.2.0.3958.jar.lastUpdated

      [DEBUG] Writing resolution tracking file /Users/erat/.m2/repository/com/adobe/flex/compiler/batik-transcoder/3.2.0.3958/batik-tran scoder-3.2.0.3958.jar.lastUpdated

      [DEBUG] Reading resolution tracking file /Users/erat/.m2/repository/com/adobe/flex/compiler/batik-util/3.2.0.3958/batik-util-3.2.0 .3958.jar.lastUpdated

      [DEBUG] Writing resolution tracking file /Users/erat/.m2/repository/com/adobe/flex/compiler/batik-util/3.2.0.3958/batik-util-3.2.0 .3958.jar.lastUpdated

      [DEBUG] Reading resolution tracking file /Users/erat/.m2/repository/com/adobe/flex/compiler/batik-xml/3.2.0.3958/batik-xml-3.2.0.3 958.jar.lastUpdated

      [DEBUG] Writing resolution tracking file /Users/erat/.m2/repository/com/adobe/flex/compiler/batik-xml/3.2.0.3958/batik-xml-3.2.0.3 958.jar.lastUpdated

      [DEBUG] Reading resolution tracking file /Users/erat/.m2/repository/com/adobe/flex/compiler/commons-collections/3.2.0.3958/commons -collections-3.2.0.3958.jar.lastUpdated

      [DEBUG] Writing resolution tracking file /Users/erat/.m2/repository/com/adobe/flex/compiler/commons-collections/3.2.0.3958/commons -collections-3.2.0.3958.jar.lastUpdated

      [DEBUG] Reading resolution tracking file /Users/erat/.m2/repository/com/adobe/flex/compiler/commons-discovery/3.2.0.3958/commons-d iscovery-3.2.0.3958.jar.lastUpdated

      [DEBUG] Writing resolution tracking file /Users/erat/.m2/repository/com/adobe/flex/compiler/commons-discovery/3.2.0.3958/commons-d iscovery-3.2.0.3958.jar.lastUpdated

      [DEBUG] Reading resolution tracking file /Users/erat/.m2/repository/com/adobe/flex/compiler/commons-logging/3.2.0.3958/commons-log ging-3.2.0.3958.jar.lastUpdated

      [DEBUG] Writing resolution tracking file /Users/erat/.m2/repository/com/adobe/flex/compiler/commons-logging/3.2.0.3958/commons-log ging-3.2.0.3958.jar.lastUpdated

      [DEBUG] Reading resolution tracking file /Users/erat/.m2/repository/com/adobe/flex/compiler/compc/3.2.0.3958/compc-3.2.0.3958.jar. lastUpdated

      [DEBUG] Writing resolution tracking file /Users/erat/.m2/repository/com/adobe/flex/compiler/compc/3.2.0.3958/compc-3.2.0.3958.jar. lastUpdated

      [DEBUG] Reading resolution tracking file /Users/erat/.m2/repository/com/adobe/flex/compiler/copylocale/3.2.0.3958/copylocale-3.2.0 .3958.jar.lastUpdated

      [DEBUG] Writing resolution tracking file /Users/erat/.m2/repository/com/adobe/flex/compiler/copylocale/3.2.0.3958/copylocale-3.2.0 .3958.jar.lastUpdated

      [DEBUG] Reading resolution tracking file /Users/erat/.m2/repository/com/adobe/flex/compiler/digest/3.2.0.3958/digest-3.2.0.3958.ja r.lastUpdated

      [DEBUG] Writing resolution tracking file /Users/erat/.m2/repository/com/adobe/flex/compiler/digest/3.2.0.3958/digest-3.2.0.3958.ja r.lastUpdated

      [DEBUG] Reading resolution tracking file /Users/erat/.m2/repository/com/adobe/flex/compiler/fcsh/3.2.0.3958/fcsh-3.2.0.3958.jar.la stUpdated

      [DEBUG] Writing resolution tracking file /Users/erat/.m2/repository/com/adobe/flex/compiler/fcsh/3.2.0.3958/fcsh-3.2.0.3958.jar.la stUpdated

      [DEBUG] Reading resolution tracking file /Users/erat/.m2/repository/com/adobe/flex/compiler/fdb/3.2.0.3958/fdb-3.2.0.3958.jar.last Updated

      [DEBUG] Writing resolution tracking file /Users/erat/.m2/repository/com/adobe/flex/compiler/fdb/3.2.0.3958/fdb-3.2.0.3958.jar.last Updated

      [DEBUG] Reading resolution tracking file /Users/erat/.m2/repository/com/adobe/flex/compiler/flex-compiler-oem/3.2.0.3958/flex-comp iler-oem-3.2.0.3958.jar.lastUpdated

      [DEBUG] Writing resolution tracking file /Users/erat/.m2/repository/com/adobe/flex/compiler/flex-compiler-oem/3.2.0.3958/flex-comp iler-oem-3.2.0.3958.jar.lastUpdated

      [DEBUG] Reading resolution tracking file /Users/erat/.m2/repository/com/adobe/flex/compiler/flex-messaging-common/3.2.0.3958/flex- messaging-common-3.2.0.3958.jar.lastUpdated

      [DEBUG] Writing resolution tracking file /Users/erat/.m2/repository/com/adobe/flex/compiler/flex-messaging-common/3.2.0.3958/flex- messaging-common-3.2.0.3958.jar.lastUpdated

      [DEBUG] Reading resolution tracking file /Users/erat/.m2/repository/com/adobe/flex/compiler/mm-velocity/3.2.0.3958/mm-velocity-3.2 .0.3958.jar.lastUpdated

      [DEBUG] Writing resolution tracking file /Users/erat/.m2/repository/com/adobe/flex/compiler/mm-velocity/3.2.0.3958/mm-velocity-3.2 .0.3958.jar.lastUpdated

      [DEBUG] Reading resolution tracking file /Users/erat/.m2/repository/com/adobe/flex/compiler/mxmlc/3.2.0.3958/mxmlc-3.2.0.3958.jar. lastUpdated

      [DEBUG] Writing resolution tracking file /Users/erat/.m2/repository/com/adobe/flex/compiler/mxmlc/3.2.0.3958/mxmlc-3.2.0.3958.jar. lastUpdated

      [DEBUG] Reading resolution tracking file /Users/erat/.m2/repository/com/adobe/flex/compiler/optimizer/3.2.0.3958/optimizer-3.2.0.3 958.jar.lastUpdated

      [DEBUG] Writing resolution tracking file /Users/erat/.m2/repository/com/adobe/flex/compiler/optimizer/3.2.0.3958/optimizer-3.2.0.3 958.jar.lastUpdated

      [DEBUG] Reading resolution tracking file /Users/erat/.m2/repository/com/adobe/flex/compiler/swfutils/3.2.0.3958/swfutils-3.2.0.395 8.jar.lastUpdated

      [DEBUG] Writing resolution tracking file /Users/erat/.m2/repository/com/adobe/flex/compiler/swfutils/3.2.0.3958/swfutils-3.2.0.395 8.jar.lastUpdated

      [DEBUG] Reading resolution tracking file /Users/erat/.m2/repository/com/adobe/flex/compiler/xalan/3.2.0.3958/xalan-3.2.0.3958.jar. lastUpdated

      [DEBUG] Writing resolution tracking file /Users/erat/.m2/repository/com/adobe/flex/compiler/xalan/3.2.0.3958/xalan-3.2.0.3958.jar. lastUpdated

      [DEBUG] Reading resolution tracking file /Users/erat/.m2/repository/com/adobe/flex/compiler/xercesImpl/3.2.0.3958/xercesImpl-3.2.0 .3958.jar.lastUpdated

      [DEBUG] Writing resolution tracking file /Users/erat/.m2/repository/com/adobe/flex/compiler/xercesImpl/3.2.0.3958/xercesImpl-3.2.0 .3958.jar.lastUpdated

      [DEBUG] Reading resolution tracking file /Users/erat/.m2/repository/com/adobe/flex/compiler/xercesPatch/3.2.0.3958/xercesPatch-3.2 .0.3958.jar.lastUpdated

      [DEBUG] Writing resolution tracking file /Users/erat/.m2/repository/com/adobe/flex/compiler/xercesPatch/3.2.0.3958/xercesPatch-3.2 .0.3958.jar.lastUpdated

      [DEBUG] Reading resolution tracking file /Users/erat/.m2/repository/com/adobe/flex/compiler/xmlParserAPIs/3.2.0.3958/xmlParserAPIs -3.2.0.3958.jar.lastUpdated

      [DEBUG] Writing resolution tracking file /Users/erat/.m2/repository/com/adobe/flex/compiler/xmlParserAPIs/3.2.0.3958/xmlParserAPIs -3.2.0.3958.jar.lastUpdated

      [DEBUG] Reading resolution tracking file /Users/erat/.m2/repository/com/adobe/flex/compiler/asdoc/3.2.0.3958/asdoc-3.2.0.3958-temp late.zip.lastUpdated

      [DEBUG] Writing resolution tracking file /Users/erat/.m2/repository/com/adobe/flex/compiler/asdoc/3.2.0.3958/asdoc-3.2.0.3958-temp late.zip.lastUpdated

      [DEBUG] Reading resolution tracking file /Users/erat/.m2/repository/org/graniteds/granite-generator/1.1.0/granite-generator-1.1.0. jar.lastUpdated

      [DEBUG] Writing resolution tracking file /Users/erat/.m2/repository/org/graniteds/granite-generator/1.1.0/granite-generator-1.1.0. jar.lastUpdated

      [DEBUG] Reading resolution tracking file /Users/erat/.m2/repository/net/sf/saxon/saxon-dom/9.0/saxon-dom-9.0.jar.lastUpdated

      [DEBUG] Writing resolution tracking file /Users/erat/.m2/repository/net/sf/saxon/saxon-dom/9.0/saxon-dom-9.0.jar.lastUpdated

      [DEBUG] Skipped remote update check for com.adobe.flex:compiler:pom:3.2.0.3958, locally cached artifact up-to-date.

      [DEBUG] Skipped remote update check for com.adobe.flex.compiler:asc:jar:3.2.0.3958, locally cached artifact up-to-date.

      [DEBUG] Skipped remote update check for com.adobe.flex.compiler:asdoc:jar:3.2.0.3958, locally cached artifact up-to-date.

      [DEBUG] Skipped remote update check for com.adobe.flex.compiler:batik-awt-util:jar:3.2.0.3958, locally cached artifact up-to-date.

      [DEBUG] Skipped remote update check for com.adobe.flex.compiler:batik-bridge:jar:3.2.0.3958, locally cached artifact up-to-date.

      [DEBUG] Skipped remote update check for com.adobe.flex.compiler:batik-css:jar:3.2.0.3958, locally cached artifact up-to-date.

      [DEBUG] Skipped remote update check for com.adobe.flex.compiler:batik-dom:jar:3.2.0.3958, locally cached artifact up-to-date.

      [DEBUG] Skipped remote update check for com.adobe.flex.compiler:batik-ext:jar:3.2.0.3958, locally cached artifact up-to-date.

      [DEBUG] Skipped remote update check for com.adobe.flex.compiler:batik-gvt:jar:3.2.0.3958, locally cached artifact up-to-date.

      [DEBUG] Skipped remote update check for com.adobe.flex.compiler:batik-parser:jar:3.2.0.3958, locally cached artifact up-to-date.

      [DEBUG] Skipped remote update check for com.adobe.flex.compiler:batik-script:jar:3.2.0.3958, locally cached artifact up-to-date.

      [DEBUG] Skipped remote update check for com.adobe.flex.compiler:batik-svg-dom:jar:3.2.0.3958, locally cached artifact up-to-date.

      [DEBUG] Skipped remote update check for com.adobe.flex.compiler:batik-svggen:jar:3.2.0.3958, locally cached artifact up-to-date.

      [DEBUG] Skipped remote update check for com.adobe.flex.compiler:batik-transcoder:jar:3.2.0.3958, locally cached artifact up-to-date.

      [DEBUG] Skipped remote update check for com.adobe.flex.compiler:batik-util:jar:3.2.0.3958, locally cached artifact up-to-date.

      [DEBUG] Skipped remote update check for com.adobe.flex.compiler:batik-xml:jar:3.2.0.3958, locally cached artifact up-to-date.

      [DEBUG] Skipped remote update check for com.adobe.flex.compiler:commons-collections:jar:3.2.0.3958, locally cached artifact up-to-date.

      [DEBUG] Skipped remote update check for com.adobe.flex.compiler:commons-discovery:jar:3.2.0.3958, locally cached artifact up-to-date.

      [DEBUG] Skipped remote update check for com.adobe.flex.compiler:commons-logging:jar:3.2.0.3958, locally cached artifact up-to-date.

      [DEBUG] Skipped remote update check for com.adobe.flex.compiler:compc:jar:3.2.0.3958, locally cached artifact up-to-date.

      [DEBUG] Skipped remote update check for com.adobe.flex.compiler:copylocale:jar:3.2.0.3958, locally cached artifact up-to-date.

      [DEBUG] Skipped remote update check for com.adobe.flex.compiler:digest:jar:3.2.0.3958, locally cached artifact up-to-date.

      [DEBUG] Skipped remote update check for com.adobe.flex.compiler:fcsh:jar:3.2.0.3958, locally cached artifact up-to-date.

      [DEBUG] Skipped remote update check for com.adobe.flex.compiler:fdb:jar:3.2.0.3958, locally cached artifact up-to-date.

      [DEBUG] Skipped remote update check for com.adobe.flex.compiler:flex-compiler-oem:jar:3.2.0.3958, locally cached artifact up-to-date.

      [DEBUG] Skipped remote update check for com.adobe.flex.compiler:flex-messaging-common:jar:3.2.0.3958, locally cached artifact up-to-date.

      [DEBUG] Skipped remote update check for com.adobe.flex.compiler:mm-velocity:jar:3.2.0.3958, locally cached artifact up-to-date.

      [DEBUG] Skipped remote update check for com.adobe.flex.compiler:mxmlc:jar:3.2.0.3958, locally cached artifact up-to-date.

      [DEBUG] Skipped remote update check for com.adobe.flex.compiler:optimizer:jar:3.2.0.3958, locally cached artifact up-to-date.

      [DEBUG] Skipped remote update check for com.adobe.flex.compiler:swfutils:jar:3.2.0.3958, locally cached artifact up-to-date.

      [DEBUG] Skipped remote update check for com.adobe.flex.compiler:xalan:jar:3.2.0.3958, locally cached artifact up-to-date.

      [DEBUG] Skipped remote update check for com.adobe.flex.compiler:xercesImpl:jar:3.2.0.3958, locally cached artifact up-to-date.

      [DEBUG] Skipped remote update check for com.adobe.flex.compiler:xercesPatch:jar:3.2.0.3958, locally cached artifact up-to-date.

      [DEBUG] Skipped remote update check for com.adobe.flex.compiler:xmlParserAPIs:jar:3.2.0.3958, locally cached artifact up-to-date.

      [DEBUG] Skipped remote update check for com.adobe.flex.compiler:asdoc:zip:template:3.2.0.3958, locally cached artifact up-to-date.

      [DEBUG] Skipped remote update check for org.graniteds:granite-generator:jar:1.1.0, locally cached artifact up-to-date.

      [DEBUG] Skipped remote update check for net.sf.saxon:saxon-dom:jar:9.0, locally cached artifact up-to-date.

      [DEBUG] Using connector WagonRepositoryConnector with priority 0 for http://repo1.maven.org/maven2

      Downloading: http://repo1.maven.org/maven2/com/adobe/flex/compiler/3.2.0.3958/compiler-3.2.0.3958.pom

      Downloading: http://repo1.maven.org/maven2/com/adobe/flex/compiler/asc/3.2.0.3958/asc-3.2.0.3958.jar

      Downloading: http://repo1.maven.org/maven2/com/adobe/flex/compiler/asdoc/3.2.0.3958/asdoc-3.2.0.3958.ja r

      Downloading: http://repo1.maven.org/maven2/com/adobe/flex/compiler/batik-awt-util/3.2.0.3958/batik-awt- util-3.2.0.3958.jar

      Downloading: http://repo1.maven.org/maven2/com/adobe/flex/compiler/batik-bridge/3.2.0.3958/batik-bridge -3.2.0.3958.jar

      Downloading: http://repo1.maven.org/maven2/com/adobe/flex/compiler/batik-css/3.2.0.3958/batik-css-3.2.0 .3958.jar

      Downloading: http://repo1.maven.org/maven2/com/adobe/flex/compiler/batik-dom/3.2.0.3958/batik-dom-3.2.0 .3958.jar

      Downloading: http://repo1.maven.org/maven2/com/adobe/flex/compiler/batik-ext/3.2.0.3958/batik-ext-3.2.0 .3958.jar

      Downloading: http://repo1.maven.org/maven2/com/adobe/flex/compiler/batik-gvt/3.2.0.3958/batik-gvt-3.2.0 .3958.jar

      Downloading: http://repo1.maven.org/maven2/com/adobe/flex/compiler/batik-parser/3.2.0.3958/batik-parser -3.2.0.3958.jar

      Downloading: http://repo1.maven.org/maven2/com/adobe/flex/compiler/batik-script/3.2.0.3958/batik-script -3.2.0.3958.jar

      Downloading: http://repo1.maven.org/maven2/com/adobe/flex/compiler/batik-svg-dom/3.2.0.3958/batik-svg-d om-3.2.0.3958.jar

      Downloading: http://repo1.maven.org/maven2/com/adobe/flex/compiler/batik-svggen/3.2.0.3958/batik-svggen -3.2.0.3958.jar

      Downloading: http://repo1.maven.org/maven2/com/adobe/flex/compiler/batik-transcoder/3.2.0.3958/batik-tr anscoder-3.2.0.3958.jar

      Downloading: http://repo1.maven.org/maven2/com/adobe/flex/compiler/batik-util/3.2.0.3958/batik-util-3.2 .0.3958.jar

      Downloading: http://repo1.maven.org/maven2/com/adobe/flex/compiler/batik-xml/3.2.0.3958/batik-xml-3.2.0 .3958.jar

      Downloading: http://repo1.maven.org/maven2/com/adobe/flex/compiler/commons-collections/3.2.0.3958/commo ns-collections-3.2.0.3958.jar

      Downloading: http://repo1.maven.org/maven2/com/adobe/flex/compiler/commons-discovery/3.2.0.3958/commons -discovery-3.2.0.3958.jar

      Downloading: http://repo1.maven.org/maven2/com/adobe/flex/compiler/commons-logging/3.2.0.3958/commons-l ogging-3.2.0.3958.jar

      Downloading: http://repo1.maven.org/maven2/com/adobe/flex/compiler/compc/3.2.0.3958/compc-3.2.0.3958.ja r

      Downloading: http://repo1.maven.org/maven2/com/adobe/flex/compiler/copylocale/3.2.0.3958/copylocale-3.2 .0.3958.jar

      Downloading: http://repo1.maven.org/maven2/com/adobe/flex/compiler/digest/3.2.0.3958/digest-3.2.0.3958. jar

      Downloading: http://repo1.maven.org/maven2/com/adobe/flex/compiler/fcsh/3.2.0.3958/fcsh-3.2.0.3958.jar

      Downloading: http://repo1.maven.org/maven2/com/adobe/flex/compiler/fdb/3.2.0.3958/fdb-3.2.0.3958.jar

      Downloading: http://repo1.maven.org/maven2/com/adobe/flex/compiler/flex-compiler-oem/3.2.0.3958/flex-co mpiler-oem-3.2.0.3958.jar

      Downloading: http://repo1.maven.org/maven2/com/adobe/flex/compiler/flex-messaging-common/3.2.0.3958/fle x-messaging-common-3.2.0.3958.jar

      Downloading: http://repo1.maven.org/maven2/com/adobe/flex/compiler/mm-velocity/3.2.0.3958/mm-velocity-3 .2.0.3958.jar

      Downloading: http://repo1.maven.org/maven2/com/adobe/flex/compiler/mxmlc/3.2.0.3958/mxmlc-3.2.0.3958.ja r

      Downloading: http://repo1.maven.org/maven2/com/adobe/flex/compiler/optimizer/3.2.0.3958/optimizer-3.2.0 .3958.jar

      Downloading: http://repo1.maven.org/maven2/com/adobe/flex/compiler/swfutils/3.2.0.3958/swfutils-3.2.0.3 958.jar

      Downloading: http://repo1.maven.org/maven2/com/adobe/flex/compiler/xalan/3.2.0.3958/xalan-3.2.0.3958.ja r

      Downloading: http://repo1.maven.org/maven2/com/adobe/flex/compiler/xercesImpl/3.2.0.3958/xercesImpl-3.2 .0.3958.jar

      Downloading: http://repo1.maven.org/maven2/com/adobe/flex/compiler/xercesPatch/3.2.0.3958/xercesPatch-3 .2.0.3958.jar

      Downloading: http://repo1.maven.org/maven2/com/adobe/flex/compiler/xmlParserAPIs/3.2.0.3958/xmlParserAP Is-3.2.0.3958.jar

      Downloading: http://repo1.maven.org/maven2/com/adobe/flex/compiler/asdoc/3.2.0.3958/asdoc-3.2.0.3958-te mplate.zip

      Downloading: http://repo1.maven.org/maven2/org/graniteds/granite-generator/1.1.0/granite-generator-1.1. 0.jar

      Downloading: http://repo1.maven.org/maven2/net/sf/saxon/saxon-dom/9.0/saxon-dom-9.0.jar

      [DEBUG] Reading resolution tracking file /Users/erat/.m2/repository/com/adobe/flex/compiler/3.2.0.3958/compiler-3.2.0.3958.pom.las tUpdated

      [DEBUG] Writing resolution tracking file /Users/erat/.m2/repository/com/adobe/flex/compiler/3.2.0.3958/compiler-3.2.0.3958.pom.las tUpdated

      [DEBUG] Reading resolution tracking file /Users/erat/.m2/repository/com/adobe/flex/compiler/asc/3.2.0.3958/asc-3.2.0.3958.jar.last Updated

      [DEBUG] Writing resolution tracking file /Users/erat/.m2/repository/com/adobe/flex/compiler/asc/3.2.0.3958/asc-3.2.0.3958.jar.last Updated

      [DEBUG] Reading resolution tracking file /Users/erat/.m2/repository/com/adobe/flex/compiler/asdoc/3.2.0.3958/asdoc-3.2.0.3958.jar. lastUpdated

      [DEBUG] Writing resolution tracking file /Users/erat/.m2/repository/com/adobe/flex/compiler/asdoc/3.2.0.3958/asdoc-3.2.0.3958.jar. lastUpdated

      [DEBUG] Reading resolution tracking file /Users/erat/.m2/repository/com/adobe/flex/compiler/batik-awt-util/3.2.0.3958/batik-awt-ut il-3.2.0.3958.jar.lastUpdated

      [DEBUG] Writing resolution tracking file /Users/erat/.m2/repository/com/adobe/flex/compiler/batik-awt-util/3.2.0.3958/batik-awt-ut il-3.2.0.3958.jar.lastUpdated

      [DEBUG] Reading resolution tracking file /Users/erat/.m2/repository/com/adobe/flex/compiler/batik-bridge/3.2.0.3958/batik-bridge-3 .2.0.3958.jar.lastUpdated

      [DEBUG] Writing resolution tracking file /Users/erat/.m2/repository/com/adobe/flex/compiler/batik-bridge/3.2.0.3958/batik-bridge-3 .2.0.3958.jar.lastUpdated

      [DEBUG] Reading resolution tracking file /Users/erat/.m2/repository/com/adobe/flex/compiler/batik-css/3.2.0.3958/batik-css-3.2.0.3 958.jar.lastUpdated

      [DEBUG] Writing resolution tracking file /Users/erat/.m2/repository/com/adobe/flex/compiler/batik-css/3.2.0.3958/batik-css-3.2.0.3 958.jar.lastUpdated

      [DEBUG] Reading resolution tracking file /Users/erat/.m2/repository/com/adobe/flex/compiler/batik-dom/3.2.0.3958/batik-dom-3.2.0.3 958.jar.lastUpdated

      [DEBUG] Writing resolution tracking file /Users/erat/.m2/repository/com/adobe/flex/compiler/batik-dom/3.2.0.3958/batik-dom-3.2.0.3 958.jar.lastUpdated

      [DEBUG] Reading resolution tracking file /Users/erat/.m2/repository/com/adobe/flex/compiler/batik-ext/3.2.0.3958/batik-ext-3.2.0.3 958.jar.lastUpdated

      [DEBUG] Writing resolution tracking file /Users/erat/.m2/repository/com/adobe/flex/compiler/batik-ext/3.2.0.3958/batik-ext-3.2.0.3 958.jar.lastUpdated

      [DEBUG] Reading resolution tracking file /Users/erat/.m2/repository/com/adobe/flex/compiler/batik-gvt/3.2.0.3958/batik-gvt-3.2.0.3 958.jar.lastUpdated

      [DEBUG] Writing resolution tracking file /Users/erat/.m2/repository/com/adobe/flex/compiler/batik-gvt/3.2.0.3958/batik-gvt-3.2.0.3 958.jar.lastUpdated

      [DEBUG] Reading resolution tracking file /Users/erat/.m2/repository/com/adobe/flex/compiler/batik-parser/3.2.0.3958/batik-parser-3 .2.0.3958.jar.lastUpdated

      [DEBUG] Writing resolution tracking file /Users/erat/.m2/repository/com/adobe/flex/compiler/batik-parser/3.2.0.3958/batik-parser-3 .2.0.3958.jar.lastUpdated

      [DEBUG] Reading resolution tracking file /Users/erat/.m2/repository/com/adobe/flex/compiler/batik-script/3.2.0.3958/batik-script-3 .2.0.3958.jar.lastUpdated

      [DEBUG] Writing resolution tracking file /Users/erat/.m2/repository/com/adobe/flex/compiler/batik-script/3.2.0.3958/batik-script-3 .2.0.3958.jar.lastUpdated

      [DEBUG] Reading resolution tracking file /Users/erat/.m2/repository/com/adobe/flex/compiler/batik-svg-dom/3.2.0.3958/batik-svg-dom -3.2.0.3958.jar.lastUpdated

      [DEBUG] Writing resolution tracking file /Users/erat/.m2/repository/com/adobe/flex/compiler/batik-svg-dom/3.2.0.3958/batik-svg-dom -3.2.0.3958.jar.lastUpdated

      [DEBUG] Reading resolution tracking file /Users/erat/.m2/repository/com/adobe/flex/compiler/batik-svggen/3.2.0.3958/batik-svggen-3 .2.0.3958.jar.lastUpdated

      [DEBUG] Writing resolution tracking file /Users/erat/.m2/repository/com/adobe/flex/compiler/batik-svggen/3.2.0.3958/batik-svggen-3 .2.0.3958.jar.lastUpdated

      [DEBUG] Reading resolution tracking file /Users/erat/.m2/repository/com/adobe/flex/compiler/batik-transcoder/3.2.0.3958/batik-tran scoder-3.2.0.3958.jar.lastUpdated

      [DEBUG] Writing resolution tracking file /Users/erat/.m2/repository/com/adobe/flex/compiler/batik-transcoder/3.2.0.3958/batik-tran scoder-3.2.0.3958.jar.lastUpdated

      [DEBUG] Reading resolution tracking file /Users/erat/.m2/repository/com/adobe/flex/compiler/batik-util/3.2.0.3958/batik-util-3.2.0 .3958.jar.lastUpdated

      [DEBUG] Writing resolution tracking file /Users/erat/.m2/repository/com/adobe/flex/compiler/batik-util/3.2.0.3958/batik-util-3.2.0 .3958.jar.lastUpdated

      [DEBUG] Reading resolution tracking file /Users/erat/.m2/repository/com/adobe/flex/compiler/batik-xml/3.2.0.3958/batik-xml-3.2.0.3 958.jar.lastUpdated

      [DEBUG] Writing resolution tracking file /Users/erat/.m2/repository/com/adobe/flex/compiler/batik-xml/3.2.0.3958/batik-xml-3.2.0.3 958.jar.lastUpdated

      [DEBUG] Reading resolution tracking file /Users/erat/.m2/repository/com/adobe/flex/compiler/commons-collections/3.2.0.3958/commons -collections-3.2.0.3958.jar.lastUpdated

      [DEBUG] Writing resolution tracking file /Users/erat/.m2/repository/com/adobe/flex/compiler/commons-collections/3.2.0.3958/commons -collections-3.2.0.3958.jar.lastUpdated

      [DEBUG] Reading resolution tracking file /Users/erat/.m2/repository/com/adobe/flex/compiler/commons-discovery/3.2.0.3958/commons-d iscovery-3.2.0.3958.jar.lastUpdated

      [DEBUG] Writing resolution tracking file /Users/erat/.m2/repository/com/adobe/flex/compiler/commons-discovery/3.2.0.3958/commons-d iscovery-3.2.0.3958.jar.lastUpdated

      [DEBUG] Reading resolution tracking file /Users/erat/.m2/repository/com/adobe/flex/compiler/commons-logging/3.2.0.3958/commons-log ging-3.2.0.3958.jar.lastUpdated

      [DEBUG] Writing resolution tracking file /Users/erat/.m2/repository/com/adobe/flex/compiler/commons-logging/3.2.0.3958/commons-log ging-3.2.0.3958.jar.lastUpdated

      [DEBUG] Reading resolution tracking file /Users/erat/.m2/repository/com/adobe/flex/compiler/compc/3.2.0.3958/compc-3.2.0.3958.jar. lastUpdated

      [DEBUG] Writing resolution tracking file /Users/erat/.m2/repository/com/adobe/flex/compiler/compc/3.2.0.3958/compc-3.2.0.3958.jar. lastUpdated

      [DEBUG] Reading resolution tracking file /Users/erat/.m2/repository/com/adobe/flex/compiler/copylocale/3.2.0.3958/copylocale-3.2.0 .3958.jar.lastUpdated

      [DEBUG] Writing resolution tracking file /Users/erat/.m2/repository/com/adobe/flex/compiler/copylocale/3.2.0.3958/copylocale-3.2.0 .3958.jar.lastUpdated

      [DEBUG] Reading resolution tracking file /Users/erat/.m2/repository/com/adobe/flex/compiler/digest/3.2.0.3958/digest-3.2.0.3958.ja r.lastUpdated

      [DEBUG] Writing resolution tracking file /Users/erat/.m2/repository/com/adobe/flex/compiler/digest/3.2.0.3958/digest-3.2.0.3958.ja r.lastUpdated

      [DEBUG] Reading resolution tracking file /Users/erat/.m2/repository/com/adobe/flex/compiler/fcsh/3.2.0.3958/fcsh-3.2.0.3958.jar.la stUpdated

      [DEBUG] Writing resolution tracking file /Users/erat/.m2/repository/com/adobe/flex/compiler/fcsh/3.2.0.3958/fcsh-3.2.0.3958.jar.la stUpdated

      [DEBUG] Reading resolution tracking file /Users/erat/.m2/repository/com/adobe/flex/compiler/fdb/3.2.0.3958/fdb-3.2.0.3958.jar.last Updated

      [DEBUG] Writing resolution tracking file /Users/erat/.m2/repository/com/adobe/flex/compiler/fdb/3.2.0.3958/fdb-3.2.0.3958.jar.last Updated

      [DEBUG] Reading resolution tracking file /Users/erat/.m2/repository/com/adobe/flex/compiler/flex-compiler-oem/3.2.0.3958/flex-comp iler-oem-3.2.0.3958.jar.lastUpdated

      [DEBUG] Writing resolution tracking file /Users/erat/.m2/repository/com/adobe/flex/compiler/flex-compiler-oem/3.2.0.3958/flex-comp iler-oem-3.2.0.3958.jar.lastUpdated

      [DEBUG] Reading resolution tracking file /Users/erat/.m2/repository/com/adobe/flex/compiler/flex-messaging-common/3.2.0.3958/flex- messaging-common-3.2.0.3958.jar.lastUpdated

      [DEBUG] Writing resolution tracking file /Users/erat/.m2/repository/com/adobe/flex/compiler/flex-messaging-common/3.2.0.3958/flex- messaging-common-3.2.0.3958.jar.lastUpdated

      [DEBUG] Reading resolution tracking file /Users/erat/.m2/repository/com/adobe/flex/compiler/mm-velocity/3.2.0.3958/mm-velocity-3.2 .0.3958.jar.lastUpdated

      [DEBUG] Writing resolution tracking file /Users/erat/.m2/repository/com/adobe/flex/compiler/mm-velocity/3.2.0.3958/mm-velocity-3.2 .0.3958.jar.lastUpdated

      [DEBUG] Reading resolution tracking file /Users/erat/.m2/repository/com/adobe/flex/compiler/mxmlc/3.2.0.3958/mxmlc-3.2.0.3958.jar. lastUpdated

      [DEBUG] Writing resolution tracking file /Users/erat/.m2/repository/com/adobe/flex/compiler/mxmlc/3.2.0.3958/mxmlc-3.2.0.3958.jar. lastUpdated

      [DEBUG] Reading resolution tracking file /Users/erat/.m2/repository/com/adobe/flex/compiler/optimizer/3.2.0.3958/optimizer-3.2.0.3 958.jar.lastUpdated

      [DEBUG] Writing resolution tracking file /Users/erat/.m2/repository/com/adobe/flex/compiler/optimizer/3.2.0.3958/optimizer-3.2.0.3 958.jar.lastUpdated

      [DEBUG] Reading resolution tracking file /Users/erat/.m2/repository/com/adobe/flex/compiler/swfutils/3.2.0.3958/swfutils-3.2.0.395 8.jar.lastUpdated

      [DEBUG] Writing resolution tracking file /Users/erat/.m2/repository/com/adobe/flex/compiler/swfutils/3.2.0.3958/swfutils-3.2.0.395 8.jar.lastUpdated

      [DEBUG] Reading resolution tracking file /Users/erat/.m2/repository/com/adobe/flex/compiler/xalan/3.2.0.3958/xalan-3.2.0.3958.jar. lastUpdated

      [DEBUG] Writing resolution tracking file /Users/erat/.m2/repository/com/adobe/flex/compiler/xalan/3.2.0.3958/xalan-3.2.0.3958.jar. lastUpdated

      [DEBUG] Reading resolution tracking file /Users/erat/.m2/repository/com/adobe/flex/compiler/xercesImpl/3.2.0.3958/xercesImpl-3.2.0 .3958.jar.lastUpdated

      [DEBUG] Writing resolution tracking file /Users/erat/.m2/repository/com/adobe/flex/compiler/xercesImpl/3.2.0.3958/xercesImpl-3.2.0 .3958.jar.lastUpdated

      [DEBUG] Reading resolution tracking file /Users/erat/.m2/repository/com/adobe/flex/compiler/xercesPatch/3.2.0.3958/xercesPatch-3.2 .0.3958.jar.lastUpdated

      [DEBUG] Writing resolution tracking file /Users/erat/.m2/repository/com/adobe/flex/compiler/xercesPatch/3.2.0.3958/xercesPatch-3.2 .0.3958.jar.lastUpdated

      [DEBUG] Reading resolution tracking file /Users/erat/.m2/repository/com/adobe/flex/compiler/xmlParserAPIs/3.2.0.3958/xmlParserAPIs -3.2.0.3958.jar.lastUpdated

      [DEBUG] Writing resolution tracking file /Users/erat/.m2/repository/com/adobe/flex/compiler/xmlParserAPIs/3.2.0.3958/xmlParserAPIs -3.2.0.3958.jar.lastUpdated

      [DEBUG] Reading resolution tracking file /Users/erat/.m2/repository/com/adobe/flex/compiler/asdoc/3.2.0.3958/asdoc-3.2.0.3958-temp late.zip.lastUpdated

      [DEBUG] Writing resolution tracking file /Users/erat/.m2/repository/com/adobe/flex/compiler/asdoc/3.2.0.3958/asdoc-3.2.0.3958-temp late.zip.lastUpdated

      [DEBUG] Reading resolution tracking file /Users/erat/.m2/repository/org/graniteds/granite-generator/1.1.0/granite-generator-1.1.0. jar.lastUpdated

      [DEBUG] Writing resolution tracking file /Users/erat/.m2/repository/org/graniteds/granite-generator/1.1.0/granite-generator-1.1.0. jar.lastUpdated

      [DEBUG] Reading resolution tracking file /Users/erat/.m2/repository/net/sf/saxon/saxon-dom/9.0/saxon-dom-9.0.jar.lastUpdated

      [DEBUG] Writing resolution tracking file /Users/erat/.m2/repository/net/sf/saxon/saxon-dom/9.0/saxon-dom-9.0.jar.lastUpdated

      [DEBUG] Looking up lifecyle mappings for packaging swc from ClassRealm[plexus.core, parent: null]

      [DEBUG] Extension realms for project com.adobe.ac:flex-pmd-hybrid-parent:pom:1.3-SNAPSHOT: (none)

      [DEBUG] Looking up lifecyle mappings for packaging pom from ClassRealm[plexus.core, parent: null]

      [DEBUG] Extension realms for project com.adobe.ac:flex-pmd-automator:pom:1.3-SNAPSHOT: (none)

      [DEBUG] Looking up lifecyle mappings for packaging pom from ClassRealm[plexus.core, parent: null]

      [DEBUG] Extension realms for project com.adobe.ac:flex-pmd-hybrid-parent-all-in-one-bundle:pom:1.3-SNAPSHOT: (none)

      [DEBUG] Looking up lifecyle mappings for packaging pom from ClassRealm[plexus.core, parent: null]

      [DEBUG] Extension realms for project com.adobe.ac:flex-pmd-java-parent:pom:1.3-SNAPSHOT: (none)

      [DEBUG] Looking up lifecyle mappings for packaging pom from ClassRealm[plexus.core, parent: null]

      [DEBUG] Extension realms for project com.adobe.ac:as3-parser:jar:1.3-SNAPSHOT: (none)

      [DEBUG] Looking up lifecyle mappings for packaging jar from ClassRealm[plexus.core, parent: null]

      [DEBUG] Extension realms for project com.adobe.ac:as3-parser-api:jar:1.3-SNAPSHOT: (none)

      [DEBUG] Looking up lifecyle mappings for packaging jar from ClassRealm[plexus.core, parent: null]

      [DEBUG] Extension realms for project com.adobe.ac:as3-plugin-utils:jar:1.3-SNAPSHOT: (none)

      [DEBUG] Looking up lifecyle mappings for packaging jar from ClassRealm[plexus.core, parent: null]

      [DEBUG] Extension realms for project com.adobe.ac:flex-pmd-test-resources:pom:1.3-SNAPSHOT: (none)

      [DEBUG] Looking up lifecyle mappings for packaging pom from ClassRealm[plexus.core, parent: null]

      [DEBUG] Extension realms for project com.adobe.ac:flex-pmd-ruleset:jar:1.3-SNAPSHOT: (none)

      [DEBUG] Looking up lifecyle mappings for packaging jar from ClassRealm[plexus.core, parent: null]

      [DEBUG] Extension realms for project com.adobe.ac:flex-pmd-cpd:jar:1.3-SNAPSHOT: (none)

      [DEBUG] Looking up lifecyle mappings for packaging jar from ClassRealm[plexus.core, parent: null]

      [DEBUG] Extension realms for project com.adobe.ac:flex-pmd-cpd-ant-task:jar:1.3-SNAPSHOT: (none)

      [DEBUG] Looking up lifecyle mappings for packaging jar from ClassRealm[plexus.core, parent: null]

      [DEBUG] Extension realms for project com.adobe.ac:flex-pmd-cpd-maven-plugin:maven-plugin:1.3-SNAPSHOT: (none)

      [DEBUG] Looking up lifecyle mappings for packaging maven-plugin from ClassRealm[plexus.core, parent: null]

      [DEBUG] Extension realms for project com.adobe.ac:flex-pmd-cpd-command-line:jar:1.3-SNAPSHOT: (none)

      [DEBUG] Looking up lifecyle mappings for packaging jar from ClassRealm[plexus.core, parent: null]

      [DEBUG] Extension realms for project com.adobe.ac:flex-pmd-ruleset-api:jar:1.3-SNAPSHOT: (none)

      [DEBUG] Looking up lifecyle mappings for packaging jar from ClassRealm[plexus.core, parent: null]

      [DEBUG] Extension realms for project com.adobe.ac:flex-pmd-core:jar:1.3-SNAPSHOT: (none)

      [DEBUG] Looking up lifecyle mappings for packaging jar from ClassRealm[plexus.core, parent: null]

      [DEBUG] Extension realms for project com.adobe.ac:flex-pmd-ant-task:jar:1.3-SNAPSHOT: (none)

      [DEBUG] Looking up lifecyle mappings for packaging jar from ClassRealm[plexus.core, parent: null]

      [DEBUG] Extension realms for project com.adobe.ac:flex-pmd-maven-plugin:maven-plugin:1.3-SNAPSHOT: (none)

      [DEBUG] Looking up lifecyle mappings for packaging maven-plugin from ClassRealm[plexus.core, parent: null]

      [DEBUG] Extension realms for project com.adobe.ac:flex-pmd-command-line:jar:1.3-SNAPSHOT: (none)

      [DEBUG] Looking up lifecyle mappings for packaging jar from ClassRealm[plexus.core, parent: null]

      [DEBUG] Extension realms for project com.adobe.ac:flex-pmd-command-line-api:jar:1.3-SNAPSHOT: (none)

      [DEBUG] Looking up lifecyle mappings for packaging jar from ClassRealm[plexus.core, parent: null]

      [DEBUG] Extension realms for project com.adobe.ac:flex-pmd-files:jar:1.3-SNAPSHOT: (none)

      [DEBUG] Looking up lifecyle mappings for packaging jar from ClassRealm[plexus.core, parent: null]

      [DEBUG] Extension realms for project com.adobe.ac:flex-pmd-metrics:jar:1.3-SNAPSHOT: (none)

      [DEBUG] Looking up lifecyle mappings for packaging jar from ClassRealm[plexus.core, parent: null]

      [DEBUG] Extension realms for project com.adobe.ac:flex-pmd-metrics-command-line:jar:1.3-SNAPSHOT: (none)

      [DEBUG] Looking up lifecyle mappings for packaging jar from ClassRealm[plexus.core, parent: null]

      [DEBUG] Extension realms for project com.adobe.ac:flex-pmd-metrics-ant-task:jar:1.3-SNAPSHOT: (none)

      [DEBUG] Looking up lifecyle mappings for packaging jar from ClassRealm[plexus.core, parent: null]

      [DEBUG] Extension realms for project com.adobe.ac:flex-pmd-metrics-maven-plugin:maven-plugin:1.3-SNAPSHOT: (none)

      [DEBUG] Looking up lifecyle mappings for packaging maven-plugin from ClassRealm[plexus.core, parent: null]

      [ERROR] The build could not read 1 project -> [Help 1]

      org.apache.maven.project.ProjectBuildingException: Some problems were encountered while processing the POMs:

      [WARNING] 'build.plugins.plugin.(groupId:artifactId)' must be unique but found duplicate declaration of plugin org.sonatype.flexmojos:flexmojos-maven-plugin @ line 194, column 12

      [WARNING] 'build.plugins.plugin.version' for org.apache.maven.plugins:maven-compiler-plugin is missing. @ com.adobe.ac:flex-pmd:1.3-SNAPSHOT, /opt/flexpmd/trunk/flex-pmd-parent/pom.xml, line 197, column 12

      [WARNING] 'dependencies.dependency.scope' for com.adobe.ac:flexunit-theme:swc must be one of [provided, compile, runtime, test, system] but is 'theme'. @ line 57, column 11

      [WARNING] 'repositories.repository.layout' for dist.codehaus.org uses the unsupported value 'legacy', artifact resolution might fail. @ com.adobe.ac:flex-pmd:1.3-SNAPSHOT, /opt/flexpmd/trunk/flex-pmd-parent/pom.xml, line 308, column 12

      [WARNING] 'repositories.repository.layout' for apache uses the unsupported value 'legacy', artifact resolution might fail. @ com.adobe.ac:flex-pmd:1.3-SNAPSHOT, /opt/flexpmd/trunk/flex-pmd-parent/pom.xml, line 314, column 12

      [WARNING] 'pluginRepositories.pluginRepository.layout' for dist.codehaus.org uses the unsupported value 'legacy', artifact resolution might fail. @ com.adobe.ac:flex-pmd:1.3-SNAPSHOT, /opt/flexpmd/trunk/flex-pmd-parent/pom.xml, line 353, column 12

      [WARNING] 'build.plugins.plugin.(groupId:artifactId)' must be unique but found duplicate declaration of plugin org.sonatype.flexmojos:flexmojos-maven-plugin @ line 128, column 12

      [WARNING] 'build.plugins.plugin.version' for org.apache.maven.plugins:maven-compiler-plugin is missing. @ com.adobe.ac:flex-pmd:1.3-SNAPSHOT, /opt/flexpmd/trunk/flex-pmd-parent/pom.xml, line 197, column 12

      [WARNING] 'dependencies.dependency.scope' for com.adobe.ac:flexunit-theme:swc must be one of [provided, compile, runtime, test, system] but is 'theme'. @ line 24, column 11

      [WARNING] 'repositories.repository.layout' for dist.codehaus.org uses the unsupported value 'legacy', artifact resolution might fail. @ com.adobe.ac:flex-pmd:1.3-SNAPSHOT, /opt/flexpmd/trunk/flex-pmd-parent/pom.xml, line 308, column 12

      [WARNING] 'repositories.repository.layout' for apache uses the unsupported value 'legacy', artifact resolution might fail. @ com.adobe.ac:flex-pmd:1.3-SNAPSHOT, /opt/flexpmd/trunk/flex-pmd-parent/pom.xml, line 314, column 12

      [WARNING] 'pluginRepositories.pluginRepository.layout' for dist.codehaus.org uses the unsupported value 'legacy', artifact resolution might fail. @ com.adobe.ac:flex-pmd:1.3-SNAPSHOT, /opt/flexpmd/trunk/flex-pmd-parent/pom.xml, line 353, column 12

      [WARNING] 'build.plugins.plugin.version' for org.apache.maven.plugins:maven-compiler-plugin is missing. @ com.adobe.ac:flex-pmd:1.3-SNAPSHOT, /opt/flexpmd/trunk/flex-pmd-parent/pom.xml, line 197, column 12

      [WARNING] 'repositories.repository.layout' for dist.codehaus.org uses the unsupported value 'legacy', artifact resolution might fail. @ com.adobe.ac:flex-pmd:1.3-SNAPSHOT, /opt/flexpmd/trunk/flex-pmd-parent/pom.xml, line 308, column 12

      [WARNING] 'repositories.repository.layout' for apache uses the unsupported value 'legacy', artifact resolution might fail. @ com.adobe.ac:flex-pmd:1.3-SNAPSHOT, /opt/flexpmd/trunk/flex-pmd-parent/pom.xml, line 314, column 12

      [WARNING] 'pluginRepositories.pluginRepository.layout' for dist.codehaus.org uses the unsupported value 'legacy', artifact resolution might fail. @ com.adobe.ac:flex-pmd:1.3-SNAPSHOT, /opt/flexpmd/trunk/flex-pmd-parent/pom.xml, line 353, column 12

      [WARNING] 'build.plugins.plugin.version' for org.apache.maven.plugins:maven-compiler-plugin is missing. @ com.adobe.ac:flex-pmd:1.3-SNAPSHOT, /opt/flexpmd/trunk/flex-pmd-parent/pom.xml, line 197, column 12

      [ERROR] Unresolveable build extension: Plugin org.sonatype.flexmojos:flexmojos-maven-plugin:3.5.0 or one of its dependencies could not be resolved: The following artifacts could not be resolved: com.adobe.flex:compiler:pom:3.2.0.3958, com.adobe.flex.compiler:asc:jar:3.2.0.3958, com.adobe.flex.compiler:asdoc:jar:3.2.0.3958, com.adobe.flex.compiler:batik-awt-util:jar:3.2.0.3958, com.adobe.flex.compiler:batik-bridge:jar:3.2.0.3958, com.adobe.flex.compiler:batik-css:jar:3.2.0.3958, com.adobe.flex.compiler:batik-dom:jar:3.2.0.3958, com.adobe.flex.compiler:batik-ext:jar:3.2.0.3958, com.adobe.flex.compiler:batik-gvt:jar:3.2.0.3958, com.adobe.flex.compiler:batik-parser:jar:3.2.0.3958, com.adobe.flex.compiler:batik-script:jar:3.2.0.3958, com.adobe.flex.compiler:batik-svg-dom:jar:3.2.0.3958, com.adobe.flex.compiler:batik-svggen:jar:3.2.0.3958, com.adobe.flex.compiler:batik-transcoder:jar:3.2.0.3958, com.adobe.flex.compiler:batik-util:jar:3.2.0.3958, com.adobe.flex.compiler:batik-xml:jar:3.2.0.3958, com.adobe.flex.compiler:commons-collections:jar:3.2.0.3958, com.adobe.flex.compiler:commons-discovery:jar:3.2.0.3958, com.adobe.flex.compiler:commons-logging:jar:3.2.0.3958, com.adobe.flex.compiler:compc:jar:3.2.0.3958, com.adobe.flex.compiler:copylocale:jar:3.2.0.3958, com.adobe.flex.compiler:digest:jar:3.2.0.3958, com.adobe.flex.compiler:fcsh:jar:3.2.0.3958, com.adobe.flex.compiler:fdb:jar:3.2.0.3958, com.adobe.flex.compiler:flex-compiler-oem:jar:3.2.0.3958, com.adobe.flex.compiler:flex-messaging-common:jar:3.2.0.3958, com.adobe.flex.compiler:mm-velocity:jar:3.2.0.3958, com.adobe.flex.compiler:mxmlc:jar:3.2.0.3958, com.adobe.flex.compiler:optimizer:jar:3.2.0.3958, com.adobe.flex.compiler:swfutils:jar:3.2.0.3958, com.adobe.flex.compiler:xalan:jar:3.2.0.3958, com.adobe.flex.compiler:xercesImpl:jar:3.2.0.3958, com.adobe.flex.compiler:xercesPatch:jar:3.2.0.3958, com.adobe.flex.compiler:xmlParserAPIs:jar:3.2.0.3958, com.adobe.flex.compiler:asdoc:zip:template:3.2.0.3958, org.graniteds:granite-generator:jar:1.1.0, net.sf.saxon:saxon-dom:jar:9.0: Could not transfer artifact com.adobe.flex:compiler:pom:3.2.0.3958 from/to dist.codehaus.org (http://dist.codehaus.org): No connector available to access repository dist.codehaus.org (http://dist.codehaus.org) of type legacy using the available factories WagonRepositoryConnectorFactory @

      [ERROR] Unknown packaging: swc @ line 5, column 13

      [WARNING] 'repositories.repository.layout' for dist.codehaus.org uses the unsupported value 'legacy', artifact resolution might fail. @ com.adobe.ac:flex-pmd:1.3-SNAPSHOT, /opt/flexpmd/trunk/flex-pmd-parent/pom.xml, line 308, column 12

      [WARNING] 'repositories.repository.layout' for apache uses the unsupported value 'legacy', artifact resolution might fail. @ com.adobe.ac:flex-pmd:1.3-SNAPSHOT, /opt/flexpmd/trunk/flex-pmd-parent/pom.xml, line 314, column 12

      [WARNING] 'pluginRepositories.pluginRepository.layout' for dist.codehaus.org uses the unsupported value 'legacy', artifact resolution might fail. @ com.adobe.ac:flex-pmd:1.3-SNAPSHOT, /opt/flexpmd/trunk/flex-pmd-parent/pom.xml, line 353, column 12

      [WARNING] 'build.plugins.plugin.version' for org.apache.maven.plugins:maven-compiler-plugin is missing. @ com.adobe.ac:flex-pmd:1.3-SNAPSHOT, /opt/flexpmd/trunk/flex-pmd-parent/pom.xml, line 197, column 12

      [WARNING] 'repositories.repository.layout' for dist.codehaus.org uses the unsupported value 'legacy', artifact resolution might fail. @ com.adobe.ac:flex-pmd:1.3-SNAPSHOT, /opt/flexpmd/trunk/flex-pmd-parent/pom.xml, line 308, column 12

      [WARNING] 'repositories.repository.layout' for apache uses the unsupported value 'legacy', artifact resolution might fail. @ com.adobe.ac:flex-pmd:1.3-SNAPSHOT, /opt/flexpmd/trunk/flex-pmd-parent/pom.xml, line 314, column 12

      [WARNING] 'pluginRepositories.pluginRepository.layout' for dist.codehaus.org uses the unsupported value 'legacy', artifact resolution might fail. @ com.adobe.ac:flex-pmd:1.3-SNAPSHOT, /opt/flexpmd/trunk/flex-pmd-parent/pom.xml, line 353, column 12

      [WARNING] 'build.plugins.plugin.version' for org.apache.maven.plugins:maven-compiler-plugin is missing. @ com.adobe.ac:flex-pmd-hybrid-parent:1.3-SNAPSHOT, /opt/flexpmd/trunk/flex-pmd-hybrid-parent/pom.xml, line 46, column 12

      [WARNING] 'repositories.repository.layout' for dist.codehaus.org uses the unsupported value 'legacy', artifact resolution might fail. @ com.adobe.ac:flex-pmd-hybrid-parent:1.3-SNAPSHOT, /opt/flexpmd/trunk/flex-pmd-hybrid-parent/pom.xml, line 143, column 12

      [WARNING] 'repositories.repository.layout' for apache uses the unsupported value 'legacy', artifact resolution might fail. @ com.adobe.ac:flex-pmd-hybrid-parent:1.3-SNAPSHOT, /opt/flexpmd/trunk/flex-pmd-hybrid-parent/pom.xml, line 149, column 12

      [WARNING] 'pluginRepositories.pluginRepository.layout' for dist.codehaus.org uses the unsupported value 'legacy', artifact resolution might fail. @ com.adobe.ac:flex-pmd-hybrid-parent:1.3-SNAPSHOT, /opt/flexpmd/trunk/flex-pmd-hybrid-parent/pom.xml, line 177, column 12

      [WARNING] 'artifactId' contains an expression but should be a constant. @ com.adobe.ac:${project.parent.artifactId}-all-in-one-bundle:1.3-SNAPSHOT, /opt/flexpmd/trunk/flex-pmd-bundles/pom.xml, line 3, column 14

      [WARNING] 'build.plugins.plugin.version' for org.apache.maven.plugins:maven-compiler-plugin is missing. @ com.adobe.ac:flex-pmd-hybrid-parent:1.3-SNAPSHOT, /opt/flexpmd/trunk/flex-pmd-hybrid-parent/pom.xml, line 46, column 12

      [WARNING] 'repositories.repository.layout' for dist.codehaus.org uses the unsupported value 'legacy', artifact resolution might fail. @ com.adobe.ac:flex-pmd-hybrid-parent:1.3-SNAPSHOT, /opt/flexpmd/trunk/flex-pmd-hybrid-parent/pom.xml, line 143, column 12

      [WARNING] 'repositories.repository.layout' for apache uses the unsupported value 'legacy', artifact resolution might fail. @ com.adobe.ac:flex-pmd-hybrid-parent:1.3-SNAPSHOT, /opt/flexpmd/trunk/flex-pmd-hybrid-parent/pom.xml, line 149, column 12

      [WARNING] 'pluginRepositories.pluginRepository.layout' for dist.codehaus.org uses the unsupported value 'legacy', artifact resolution might fail. @ com.adobe.ac:flex-pmd-hybrid-parent:1.3-SNAPSHOT, /opt/flexpmd/trunk/flex-pmd-hybrid-parent/pom.xml, line 177, column 12

      [WARNING] 'build.plugins.plugin.version' for org.apache.maven.plugins:maven-compiler-plugin is missing. @ line 46, column 12

      [WARNING] 'repositories.repository.layout' for dist.codehaus.org uses the unsupported value 'legacy', artifact resolution might fail. @ line 143, column 12

      [WARNING] 'repositories.repository.layout' for apache uses the unsupported value 'legacy', artifact resolution might fail. @ line 149, column 12

      [WARNING] 'pluginRepositories.pluginRepository.layout' for dist.codehaus.org uses the unsupported value 'legacy', artifact resolution might fail. @ line 177, column 12

      [WARNING] 'build.plugins.plugin.version' for org.apache.maven.plugins:maven-compiler-plugin is missing. @ com.adobe.ac:flex-pmd:1.3-SNAPSHOT, /opt/flexpmd/trunk/flex-pmd-parent/pom.xml, line 197, column 12

      [WARNING] 'repositories.repository.layout' for dist.codehaus.org uses the unsupported value 'legacy', artifact resolution might fail. @ com.adobe.ac:flex-pmd:1.3-SNAPSHOT, /opt/flexpmd/trunk/flex-pmd-parent/pom.xml, line 308, column 12

      [WARNING] 'repositories.repository.layout' for apache uses the unsupported value 'legacy', artifact resolution might fail. @ com.adobe.ac:flex-pmd:1.3-SNAPSHOT, /opt/flexpmd/trunk/flex-pmd-parent/pom.xml, line 314, column 12

      [WARNING] 'pluginRepositories.pluginRepository.layout' for dist.codehaus.org uses the unsupported value 'legacy', artifact resolution might fail. @ com.adobe.ac:flex-pmd:1.3-SNAPSHOT, /opt/flexpmd/trunk/flex-pmd-parent/pom.xml, line 353, column 12

      [WARNING] 'build.plugins.plugin.version' for org.apache.maven.plugins:maven-compiler-plugin is missing. @ com.adobe.ac:flex-pmd:1.3-SNAPSHOT, /opt/flexpmd/trunk/flex-pmd-parent/pom.xml, line 197, column 12

      [WARNING] 'repositories.repository.layout' for dist.codehaus.org uses the unsupported value 'legacy', artifact resolution might fail. @ com.adobe.ac:flex-pmd:1.3-SNAPSHOT, /opt/flexpmd/trunk/flex-pmd-parent/pom.xml, line 308, column 12

      [WARNING] 'repositories.repository.layout' for apache uses the unsupported value 'legacy', artifact resolution might fail. @ com.adobe.ac:flex-pmd:1.3-SNAPSHOT, /opt/flexpmd/trunk/flex-pmd-parent/pom.xml, line 314, column 12

      [WARNING] 'pluginRepositories.pluginRepository.layout' for dist.codehaus.org uses the unsupported value 'legacy', artifact resolution might fail. @ com.adobe.ac:flex-pmd:1.3-SNAPSHOT, /opt/flexpmd/trunk/flex-pmd-parent/pom.xml, line 353, column 12

      [WARNING] 'build.plugins.plugin.version' for org.apache.maven.plugins:maven-compiler-plugin is missing. @ com.adobe.ac:flex-pmd:1.3-SNAPSHOT, /opt/flexpmd/trunk/flex-pmd-parent/pom.xml, line 197, column 12

      [WARNING] 'repositories.repository.layout' for dist.codehaus.org uses the unsupported value 'legacy', artifact resolution might fail. @ com.adobe.ac:flex-pmd:1.3-SNAPSHOT, /opt/flexpmd/trunk/flex-pmd-parent/pom.xml, line 308, column 12

      [WARNING] 'repositories.repository.layout' for apache uses the unsupported value 'legacy', artifact resolution might fail. @ com.adobe.ac:flex-pmd:1.3-SNAPSHOT, /opt/flexpmd/trunk/flex-pmd-parent/pom.xml, line 314, column 12

      [WARNING] 'pluginRepositories.pluginRepository.layout' for dist.codehaus.org uses the unsupported value 'legacy', artifact resolution might fail. @ com.adobe.ac:flex-pmd:1.3-SNAPSHOT, /opt/flexpmd/trunk/flex-pmd-parent/pom.xml, line 353, column 12

      [WARNING] 'build.plugins.plugin.version' for org.apache.maven.plugins:maven-compiler-plugin is missing. @ com.adobe.ac:flex-pmd:1.3-SNAPSHOT, /opt/flexpmd/trunk/flex-pmd-parent/pom.xml, line 197, column 12

      [WARNING] 'repositories.repository.layout' for dist.codehaus.org uses the unsupported value 'legacy', artifact resolution might fail. @ com.adobe.ac:flex-pmd:1.3-SNAPSHOT, /opt/flexpmd/trunk/flex-pmd-parent/pom.xml, line 308, column 12

      [WARNING] 'repositories.repository.layout' for apache uses the unsupported value 'legacy', artifact resolution might fail. @ com.adobe.ac:flex-pmd:1.3-SNAPSHOT, /opt/flexpmd/trunk/flex-pmd-parent/pom.xml, line 314, column 12

      [WARNING] 'pluginRepositories.pluginRepository.layout' for dist.codehaus.org uses the unsupported value 'legacy', artifact resolution might fail. @ com.adobe.ac:flex-pmd:1.3-SNAPSHOT, /opt/flexpmd/trunk/flex-pmd-parent/pom.xml, line 353, column 12

      [WARNING] 'build.plugins.plugin.version' for org.apache.maven.plugins:maven-compiler-plugin is missing. @ com.adobe.ac:flex-pmd:1.3-SNAPSHOT, /opt/flexpmd/trunk/flex-pmd-parent/pom.xml, line 197, column 12

      [WARNING] 'repositories.repository.layout' for dist.codehaus.org uses the unsupported value 'legacy', artifact resolution might fail. @ com.adobe.ac:flex-pmd:1.3-SNAPSHOT, /opt/flexpmd/trunk/flex-pmd-parent/pom.xml, line 308, column 12

      [WARNING] 'repositories.repository.layout' for apache uses the unsupported value 'legacy', artifact resolution might fail. @ com.adobe.ac:flex-pmd:1.3-SNAPSHOT, /opt/flexpmd/trunk/flex-pmd-parent/pom.xml, line 314, column 12

      [WARNING] 'pluginRepositories.pluginRepository.layout' for dist.codehaus.org uses the unsupported value 'legacy', artifact resolution might fail. @ com.adobe.ac:flex-pmd:1.3-SNAPSHOT, /opt/flexpmd/trunk/flex-pmd-parent/pom.xml, line 353, column 12

      [WARNING] 'build.plugins.plugin.version' for org.apache.maven.plugins:maven-compiler-plugin is missing. @ com.adobe.ac:flex-pmd:1.3-SNAPSHOT, /opt/flexpmd/trunk/flex-pmd-parent/pom.xml, line 197, column 12

      [WARNING] 'repositories.repository.layout' for dist.codehaus.org uses the unsupported value 'legacy', artifact resolution might fail. @ com.adobe.ac:flex-pmd:1.3-SNAPSHOT, /opt/flexpmd/trunk/flex-pmd-parent/pom.xml, line 308, column 12

      [WARNING] 'repositories.repository.layout' for apache uses the unsupported value 'legacy', artifact resolution might fail. @ com.adobe.ac:flex-pmd:1.3-SNAPSHOT, /opt/flexpmd/trunk/flex-pmd-parent/pom.xml, line 314, column 12

      [WARNING] 'pluginRepositories.pluginRepository.layout' for dist.codehaus.org uses the unsupported value 'legacy', artifact resolution might fail. @ com.adobe.ac:flex-pmd:1.3-SNAPSHOT, /opt/flexpmd/trunk/flex-pmd-parent/pom.xml, line 353, column 12

      [WARNING] 'build.plugins.plugin.version' for org.apache.maven.plugins:maven-compiler-plugin is missing. @ com.adobe.ac:flex-pmd:1.3-SNAPSHOT, /opt/flexpmd/trunk/flex-pmd-parent/pom.xml, line 197, column 12

      [WARNING] 'repositories.repository.layout' for dist.codehaus.org uses the unsupported value 'legacy', artifact resolution might fail. @ com.adobe.ac:flex-pmd:1.3-SNAPSHOT, /opt/flexpmd/trunk/flex-pmd-parent/pom.xml, line 308, column 12

      [WARNING] 'repositories.repository.layout' for apache uses the unsupported value 'legacy', artifact resolution might fail. @ com.adobe.ac:flex-pmd:1.3-SNAPSHOT, /opt/flexpmd/trunk/flex-pmd-parent/pom.xml, line 314, column 12

      [WARNING] 'pluginRepositories.pluginRepository.layout' for dist.codehaus.org uses the unsupported value 'legacy', artifact resolution might fail. @ com.adobe.ac:flex-pmd:1.3-SNAPSHOT, /opt/flexpmd/trunk/flex-pmd-parent/pom.xml, line 353, column 12

      [WARNING] 'build.plugins.plugin.version' for org.apache.maven.plugins:maven-compiler-plugin is missing. @ com.adobe.ac:flex-pmd:1.3-SNAPSHOT, /opt/flexpmd/trunk/flex-pmd-parent/pom.xml, line 197, column 12

      [WARNING] 'repositories.repository.layout' for dist.codehaus.org uses the unsupported value 'legacy', artifact resolution might fail. @ com.adobe.ac:flex-pmd:1.3-SNAPSHOT, /opt/flexpmd/trunk/flex-pmd-parent/pom.xml, line 308, column 12

      [WARNING] 'repositories.repository.layout' for apache uses the unsupported value 'legacy', artifact resolution might fail. @ com.adobe.ac:flex-pmd:1.3-SNAPSHOT, /opt/flexpmd/trunk/flex-pmd-parent/pom.xml, line 314, column 12

      [WARNING] 'pluginRepositories.pluginRepository.layout' for dist.codehaus.org uses the unsupported value 'legacy', artifact resolution might fail. @ com.adobe.ac:flex-pmd:1.3-SNAPSHOT, /opt/flexpmd/trunk/flex-pmd-parent/pom.xml, line 353, column 12

      [WARNING] 'build.plugins.plugin.version' for org.apache.maven.plugins:maven-compiler-plugin is missing. @ com.adobe.ac:flex-pmd:1.3-SNAPSHOT, /opt/flexpmd/trunk/flex-pmd-parent/pom.xml, line 197, column 12

      [WARNING] 'repositories.repository.layout' for dist.codehaus.org uses the unsupported value 'legacy', artifact resolution might fail. @ com.adobe.ac:flex-pmd:1.3-SNAPSHOT, /opt/flexpmd/trunk/flex-pmd-parent/pom.xml, line 308, column 12

      [WARNING] 'repositories.repository.layout' for apache uses the unsupported value 'legacy', artifact resolution might fail. @ com.adobe.ac:flex-pmd:1.3-SNAPSHOT, /opt/flexpmd/trunk/flex-pmd-parent/pom.xml, line 314, column 12

      [WARNING] 'pluginRepositories.pluginRepository.layout' for dist.codehaus.org uses the unsupported value 'legacy', artifact resolution might fail. @ com.adobe.ac:flex-pmd:1.3-SNAPSHOT, /opt/flexpmd/trunk/flex-pmd-parent/pom.xml, line 353, column 12

      [WARNING] 'build.plugins.plugin.version' for org.apache.maven.plugins:maven-compiler-plugin is missing. @ com.adobe.ac:flex-pmd:1.3-SNAPSHOT, /opt/flexpmd/trunk/flex-pmd-parent/pom.xml, line 197, column 12

      [WARNING] 'repositories.repository.layout' for dist.codehaus.org uses the unsupported value 'legacy', artifact resolution might fail. @ com.adobe.ac:flex-pmd:1.3-SNAPSHOT, /opt/flexpmd/trunk/flex-pmd-parent/pom.xml, line 308, column 12

      [WARNING] 'repositories.repository.layout' for apache uses the unsupported value 'legacy', artifact resolution might fail. @ com.adobe.ac:flex-pmd:1.3-SNAPSHOT, /opt/flexpmd/trunk/flex-pmd-parent/pom.xml, line 314, column 12

      [WARNING] 'pluginRepositories.pluginRepository.layout' for dist.codehaus.org uses the unsupported value 'legacy', artifact resolution might fail. @ com.adobe.ac:flex-pmd:1.3-SNAPSHOT, /opt/flexpmd/trunk/flex-pmd-parent/pom.xml, line 353, column 12

      [WARNING] 'build.plugins.plugin.version' for org.apache.maven.plugins:maven-compiler-plugin is missing. @ com.adobe.ac:flex-pmd:1.3-SNAPSHOT, /opt/flexpmd/trunk/flex-pmd-parent/pom.xml, line 197, column 12

      [WARNING] 'repositories.repository.layout' for dist.codehaus.org uses the unsupported value 'legacy', artifact resolution might fail. @ com.adobe.ac:flex-pmd:1.3-SNAPSHOT, /opt/flexpmd/trunk/flex-pmd-parent/pom.xml, line 308, column 12

      [WARNING] 'repositories.repository.layout' for apache uses the unsupported value 'legacy', artifact resolution might fail. @ com.adobe.ac:flex-pmd:1.3-SNAPSHOT, /opt/flexpmd/trunk/flex-pmd-parent/pom.xml, line 314, column 12

      [WARNING] 'pluginRepositories.pluginRepository.layout' for dist.codehaus.org uses the unsupported value 'legacy', artifact resolution might fail. @ com.adobe.ac:flex-pmd:1.3-SNAPSHOT, /opt/flexpmd/trunk/flex-pmd-parent/pom.xml, line 353, column 12

      [WARNING] 'build.plugins.plugin.version' for org.apache.maven.plugins:maven-compiler-plugin is missing. @ com.adobe.ac:flex-pmd:1.3-SNAPSHOT, /opt/flexpmd/trunk/flex-pmd-parent/pom.xml, line 197, column 12

      [WARNING] 'repositories.repository.layout' for dist.codehaus.org uses the unsupported value 'legacy', artifact resolution might fail. @ com.adobe.ac:flex-pmd:1.3-SNAPSHOT, /opt/flexpmd/trunk/flex-pmd-parent/pom.xml, line 308, column 12

      [WARNING] 'repositories.repository.layout' for apache uses the unsupported value 'legacy', artifact resolution might fail. @ com.adobe.ac:flex-pmd:1.3-SNAPSHOT, /opt/flexpmd/trunk/flex-pmd-parent/pom.xml, line 314, column 12

      [WARNING] 'pluginRepositories.pluginRepository.layout' for dist.codehaus.org uses the unsupported value 'legacy', artifact resolution might fail. @ com.adobe.ac:flex-pmd:1.3-SNAPSHOT, /opt/flexpmd/trunk/flex-pmd-parent/pom.xml, line 353, column 12

      [WARNING] 'build.plugins.plugin.version' for org.apache.maven.plugins:maven-compiler-plugin is missing. @ com.adobe.ac:flex-pmd:1.3-SNAPSHOT, /opt/flexpmd/trunk/flex-pmd-parent/pom.xml, line 197, column 12

      [WARNING] 'repositories.repository.layout' for dist.codehaus.org uses the unsupported value 'legacy', artifact resolution might fail. @ com.adobe.ac:flex-pmd:1.3-SNAPSHOT, /opt/flexpmd/trunk/flex-pmd-parent/pom.xml, line 308, column 12

      [WARNING] 'repositories.repository.layout' for apache uses the unsupported value 'legacy', artifact resolution might fail. @ com.adobe.ac:flex-pmd:1.3-SNAPSHOT, /opt/flexpmd/trunk/flex-pmd-parent/pom.xml, line 314, column 12

      [WARNING] 'pluginRepositories.pluginRepository.layout' for dist.codehaus.org uses the unsupported value 'legacy', artifact resolution might fail. @ com.adobe.ac:flex-pmd:1.3-SNAPSHOT, /opt/flexpmd/trunk/flex-pmd-parent/pom.xml, line 353, column 12

      [WARNING] 'build.plugins.plugin.version' for org.apache.maven.plugins:maven-compiler-plugin is missing. @ com.adobe.ac:flex-pmd:1.3-SNAPSHOT, /opt/flexpmd/trunk/flex-pmd-parent/pom.xml, line 197, column 12

      [WARNING] 'repositories.repository.layout' for dist.codehaus.org uses the unsupported value 'legacy', artifact resolution might fail. @ com.adobe.ac:flex-pmd:1.3-SNAPSHOT, /opt/flexpmd/trunk/flex-pmd-parent/pom.xml, line 308, column 12

      [WARNING] 'repositories.repository.layout' for apache uses the unsupported value 'legacy', artifact resolution might fail. @ com.adobe.ac:flex-pmd:1.3-SNAPSHOT, /opt/flexpmd/trunk/flex-pmd-parent/pom.xml, line 314, column 12

      [WARNING] 'pluginRepositories.pluginRepository.layout' for dist.codehaus.org uses the unsupported value 'legacy', artifact resolution might fail. @ com.adobe.ac:flex-pmd:1.3-SNAPSHOT, /opt/flexpmd/trunk/flex-pmd-parent/pom.xml, line 353, column 12

      [WARNING] 'build.plugins.plugin.version' for org.apache.maven.plugins:maven-compiler-plugin is missing. @ com.adobe.ac:flex-pmd:1.3-SNAPSHOT, /opt/flexpmd/trunk/flex-pmd-parent/pom.xml, line 197, column 12

      [WARNING] 'repositories.repository.layout' for dist.codehaus.org uses the unsupported value 'legacy', artifact resolution might fail. @ com.adobe.ac:flex-pmd:1.3-SNAPSHOT, /opt/flexpmd/trunk/flex-pmd-parent/pom.xml, line 308, column 12

      [WARNING] 'repositories.repository.layout' for apache uses the unsupported value 'legacy', artifact resolution might fail. @ com.adobe.ac:flex-pmd:1.3-SNAPSHOT, /opt/flexpmd/trunk/flex-pmd-parent/pom.xml, line 314, column 12

      [WARNING] 'pluginRepositories.pluginRepository.layout' for dist.codehaus.org uses the unsupported value 'legacy', artifact resolution might fail. @ com.adobe.ac:flex-pmd:1.3-SNAPSHOT, /opt/flexpmd/trunk/flex-pmd-parent/pom.xml, line 353, column 12

      [WARNING] 'build.plugins.plugin.version' for org.apache.maven.plugins:maven-compiler-plugin is missing. @ com.adobe.ac:flex-pmd:1.3-SNAPSHOT, /opt/flexpmd/trunk/flex-pmd-parent/pom.xml, line 197, column 12

      [WARNING] 'repositories.repository.layout' for dist.codehaus.org uses the unsupported value 'legacy', artifact resolution might fail. @ com.adobe.ac:flex-pmd:1.3-SNAPSHOT, /opt/flexpmd/trunk/flex-pmd-parent/pom.xml, line 308, column 12

      [WARNING] 'repositories.repository.layout' for apache uses the unsupported value 'legacy', artifact resolution might fail. @ com.adobe.ac:flex-pmd:1.3-SNAPSHOT, /opt/flexpmd/trunk/flex-pmd-parent/pom.xml, line 314, column 12

      [WARNING] 'pluginRepositories.pluginRepository.layout' for dist.codehaus.org uses the unsupported value 'legacy', artifact resolution might fail. @ com.adobe.ac:flex-pmd:1.3-SNAPSHOT, /opt/flexpmd/trunk/flex-pmd-parent/pom.xml, line 353, column 12

      [WARNING] 'build.plugins.plugin.version' for org.apache.maven.plugins:maven-compiler-plugin is missing. @ com.adobe.ac:flex-pmd:1.3-SNAPSHOT, /opt/flexpmd/trunk/flex-pmd-parent/pom.xml, line 197, column 12

      [WARNING] 'repositories.repository.layout' for dist.codehaus.org uses the unsupported value 'legacy', artifact resolution might fail. @ com.adobe.ac:flex-pmd:1.3-SNAPSHOT, /opt/flexpmd/trunk/flex-pmd-parent/pom.xml, line 308, column 12

      [WARNING] 'repositories.repository.layout' for apache uses the unsupported value 'legacy', artifact resolution might fail. @ com.adobe.ac:flex-pmd:1.3-SNAPSHOT, /opt/flexpmd/trunk/flex-pmd-parent/pom.xml, line 314, column 12

      [WARNING] 'pluginRepositories.pluginRepository.layout' for dist.codehaus.org uses the unsupported value 'legacy', artifact resolution might fail. @ com.adobe.ac:flex-pmd:1.3-SNAPSHOT, /opt/flexpmd/trunk/flex-pmd-parent/pom.xml, line 353, column 12

      [WARNING] 'build.plugins.plugin.version' for org.apache.maven.plugins:maven-compiler-plugin is missing. @ com.adobe.ac:flex-pmd:1.3-SNAPSHOT, /opt/flexpmd/trunk/flex-pmd-parent/pom.xml, line 197, column 12

      [WARNING] 'repositories.repository.layout' for dist.codehaus.org uses the unsupported value 'legacy', artifact resolution might fail. @ com.adobe.ac:flex-pmd:1.3-SNAPSHOT, /opt/flexpmd/trunk/flex-pmd-parent/pom.xml, line 308, column 12

      [WARNING] 'repositories.repository.layout' for apache uses the unsupported value 'legacy', artifact resolution might fail. @ com.adobe.ac:flex-pmd:1.3-SNAPSHOT, /opt/flexpmd/trunk/flex-pmd-parent/pom.xml, line 314, column 12

      [WARNING] 'pluginRepositories.pluginRepository.layout' for dist.codehaus.org uses the unsupported value 'legacy', artifact resolution might fail. @ com.adobe.ac:flex-pmd:1.3-SNAPSHOT, /opt/flexpmd/trunk/flex-pmd-parent/pom.xml, line 353, column 12

      [WARNING] 'build.plugins.plugin.version' for org.apache.maven.plugins:maven-compiler-plugin is missing. @ com.adobe.ac:flex-pmd:1.3-SNAPSHOT, /opt/flexpmd/trunk/flex-pmd-parent/pom.xml, line 197, column 12

      [WARNING] 'repositories.repository.layout' for dist.codehaus.org uses the unsupported value 'legacy', artifact resolution might fail. @ com.adobe.ac:flex-pmd:1.3-SNAPSHOT, /opt/flexpmd/trunk/flex-pmd-parent/pom.xml, line 308, column 12

      [WARNING] 'repositories.repository.layout' for apache uses the unsupported value 'legacy', artifact resolution might fail. @ com.adobe.ac:flex-pmd:1.3-SNAPSHOT, /opt/flexpmd/trunk/flex-pmd-parent/pom.xml, line 314, column 12

      [WARNING] 'pluginRepositories.pluginRepository.layout' for dist.codehaus.org uses the unsupported value 'legacy', artifact resolution might fail. @ com.adobe.ac:flex-pmd:1.3-SNAPSHOT, /opt/flexpmd/trunk/flex-pmd-parent/pom.xml, line 353, column 12

      [WARNING] 'build.plugins.plugin.version' for org.apache.maven.plugins:maven-compiler-plugin is missing. @ com.adobe.ac:flex-pmd:1.3-SNAPSHOT, /opt/flexpmd/trunk/flex-pmd-parent/pom.xml, line 197, column 12

      [WARNING] 'repositories.repository.layout' for dist.codehaus.org uses the unsupported value 'legacy', artifact resolution might fail. @ com.adobe.ac:flex-pmd:1.3-SNAPSHOT, /opt/flexpmd/trunk/flex-pmd-parent/pom.xml, line 308, column 12

      [WARNING] 'repositories.repository.layout' for apache uses the unsupported value 'legacy', artifact resolution might fail. @ com.adobe.ac:flex-pmd:1.3-SNAPSHOT, /opt/flexpmd/trunk/flex-pmd-parent/pom.xml, line 314, column 12

      [WARNING] 'pluginRepositories.pluginRepository.layout' for dist.codehaus.org uses the unsupported value 'legacy', artifact resolution might fail. @ com.adobe.ac:flex-pmd:1.3-SNAPSHOT, /opt/flexpmd/trunk/flex-pmd-parent/pom.xml, line 353, column 12

      [WARNING] 'build.plugins.plugin.version' for org.apache.maven.plugins:maven-compiler-plugin is missing. @ com.adobe.ac:flex-pmd:1.3-SNAPSHOT, /opt/flexpmd/trunk/flex-pmd-parent/pom.xml, line 197, column 12

      [WARNING] 'repositories.repository.layout' for dist.codehaus.org uses the unsupported value 'legacy', artifact resolution might fail. @ com.adobe.ac:flex-pmd:1.3-SNAPSHOT, /opt/flexpmd/trunk/flex-pmd-parent/pom.xml, line 308, column 12

      [WARNING] 'repositories.repository.layout' for apache uses the unsupported value 'legacy', artifact resolution might fail. @ com.adobe.ac:flex-pmd:1.3-SNAPSHOT, /opt/flexpmd/trunk/flex-pmd-parent/pom.xml, line 314, column 12

      [WARNING] 'pluginRepositories.pluginRepository.layout' for dist.codehaus.org uses the unsupported value 'legacy', artifact resolution might fail. @ com.adobe.ac:flex-pmd:1.3-SNAPSHOT, /opt/flexpmd/trunk/flex-pmd-parent/pom.xml, line 353, column 12

      [WARNING] 'build.plugins.plugin.version' for org.apache.maven.plugins:maven-compiler-plugin is missing. @ line 197, column 12

      [WARNING] 'repositories.repository.layout' for dist.codehaus.org uses the unsupported value 'legacy', artifact resolution might fail. @ line 308, column 12

      [WARNING] 'repositories.repository.layout' for apache uses the unsupported value 'legacy', artifact resolution might fail. @ line 314, column 12

      [WARNING] 'pluginRepositories.pluginRepository.layout' for dist.codehaus.org uses the unsupported value 'legacy', artifact resolution might fail. @ line 353, column 12

       

          at org.apache.maven.project.DefaultProjectBuilder.build(DefaultProjectBuilder.java:339)

          at org.apache.maven.DefaultMaven.collectProjects(DefaultMaven.java:632)

          at org.apache.maven.DefaultMaven.getProjectsForMavenReactor(DefaultMaven.java:581)

          at org.apache.maven.DefaultMaven.doExecute(DefaultMaven.java:233)

          at org.apache.maven.DefaultMaven.execute(DefaultMaven.java:156)

          at org.apache.maven.cli.MavenCli.execute(MavenCli.java:537)

          at org.apache.maven.cli.MavenCli.doMain(MavenCli.java:196)

          at org.apache.maven.cli.MavenCli.main(MavenCli.java:141)

          at sun.reflect.NativeMethodAccessorImpl.invoke0(Native Method)

          at sun.reflect.NativeMethodAccessorImpl.invoke(NativeMethodAccessorImpl.java:39)

          at sun.reflect.DelegatingMethodAccessorImpl.invoke(DelegatingMethodAccessorImpl.java:25)

          at java.lang.reflect.Method.invoke(Method.java:597)

          at org.codehaus.plexus.classworlds.launcher.Launcher.launchEnhanced(Launcher.java:290)

          at org.codehaus.plexus.classworlds.launcher.Launcher.launch(Launcher.java:230)

          at org.codehaus.plexus.classworlds.launcher.Launcher.mainWithExitCode(Launcher.java:409)

          at org.codehaus.plexus.classworlds.launcher.Launcher.main(Launcher.java:352)

      [ERROR]  

      [ERROR]   The project com.adobe.ac:flexunit-theme:1.3-SNAPSHOT (/opt/flexpmd/trunk/flexunit-theme/pom.xml) has 2 errors

      [ERROR]     Unresolveable build extension: Plugin org.sonatype.flexmojos:flexmojos-maven-plugin:3.5.0 or one of its dependencies could not be resolved: The following artifacts could not be resolved: com.adobe.flex:compiler:pom:3.2.0.3958, com.adobe.flex.compiler:asc:jar:3.2.0.3958, com.adobe.flex.compiler:asdoc:jar:3.2.0.3958, com.adobe.flex.compiler:batik-awt-util:jar:3.2.0.3958, com.adobe.flex.compiler:batik-bridge:jar:3.2.0.3958, com.adobe.flex.compiler:batik-css:jar:3.2.0.3958, com.adobe.flex.compiler:batik-dom:jar:3.2.0.3958, com.adobe.flex.compiler:batik-ext:jar:3.2.0.3958, com.adobe.flex.compiler:batik-gvt:jar:3.2.0.3958, com.adobe.flex.compiler:batik-parser:jar:3.2.0.3958, com.adobe.flex.compiler:batik-script:jar:3.2.0.3958, com.adobe.flex.compiler:batik-svg-dom:jar:3.2.0.3958, com.adobe.flex.compiler:batik-svggen:jar:3.2.0.3958, com.adobe.flex.compiler:batik-transcoder:jar:3.2.0.3958, com.adobe.flex.compiler:batik-util:jar:3.2.0.3958, com.adobe.flex.compiler:batik-xml:jar:3.2.0.3958, com.adobe.flex.compiler:commons-collections:jar:3.2.0.3958, com.adobe.flex.compiler:commons-discovery:jar:3.2.0.3958, com.adobe.flex.compiler:commons-logging:jar:3.2.0.3958, com.adobe.flex.compiler:compc:jar:3.2.0.3958, com.adobe.flex.compiler:copylocale:jar:3.2.0.3958, com.adobe.flex.compiler:digest:jar:3.2.0.3958, com.adobe.flex.compiler:fcsh:jar:3.2.0.3958, com.adobe.flex.compiler:fdb:jar:3.2.0.3958, com.adobe.flex.compiler:flex-compiler-oem:jar:3.2.0.3958, com.adobe.flex.compiler:flex-messaging-common:jar:3.2.0.3958, com.adobe.flex.compiler:mm-velocity:jar:3.2.0.3958, com.adobe.flex.compiler:mxmlc:jar:3.2.0.3958, com.adobe.flex.compiler:optimizer:jar:3.2.0.3958, com.adobe.flex.compiler:swfutils:jar:3.2.0.3958, com.adobe.flex.compiler:xalan:jar:3.2.0.3958, com.adobe.flex.compiler:xercesImpl:jar:3.2.0.3958, com.adobe.flex.compiler:xercesPatch:jar:3.2.0.3958, com.adobe.flex.compiler:xmlParserAPIs:jar:3.2.0.3958, com.adobe.flex.compiler:asdoc:zip:template:3.2.0.3958, org.graniteds:granite-generator:jar:1.1.0, net.sf.saxon:saxon-dom:jar:9.0: Could not transfer artifact com.adobe.flex:compiler:pom:3.2.0.3958 from/to dist.codehaus.org (http://dist.codehaus.org): No connector available to access repository dist.codehaus.org (http://dist.codehaus.org) of type legacy using the available factories WagonRepositoryConnectorFactory -> [Help 2]

      org.apache.maven.plugin.PluginResolutionException: Plugin org.sonatype.flexmojos:flexmojos-maven-plugin:3.5.0 or one of its dependencies could not be resolved: The following artifacts could not be resolved: com.adobe.flex:compiler:pom:3.2.0.3958, com.adobe.flex.compiler:asc:jar:3.2.0.3958, com.adobe.flex.compiler:asdoc:jar:3.2.0.3958, com.adobe.flex.compiler:batik-awt-util:jar:3.2.0.3958, com.adobe.flex.compiler:batik-bridge:jar:3.2.0.3958, com.adobe.flex.compiler:batik-css:jar:3.2.0.3958, com.adobe.flex.compiler:batik-dom:jar:3.2.0.3958, com.adobe.flex.compiler:batik-ext:jar:3.2.0.3958, com.adobe.flex.compiler:batik-gvt:jar:3.2.0.3958, com.adobe.flex.compiler:batik-parser:jar:3.2.0.3958, com.adobe.flex.compiler:batik-script:jar:3.2.0.3958, com.adobe.flex.compiler:batik-svg-dom:jar:3.2.0.3958, com.adobe.flex.compiler:batik-svggen:jar:3.2.0.3958, com.adobe.flex.compiler:batik-transcoder:jar:3.2.0.3958, com.adobe.flex.compiler:batik-util:jar:3.2.0.3958, com.adobe.flex.compiler:batik-xml:jar:3.2.0.3958, com.adobe.flex.compiler:commons-collections:jar:3.2.0.3958, com.adobe.flex.compiler:commons-discovery:jar:3.2.0.3958, com.adobe.flex.compiler:commons-logging:jar:3.2.0.3958, com.adobe.flex.compiler:compc:jar:3.2.0.3958, com.adobe.flex.compiler:copylocale:jar:3.2.0.3958, com.adobe.flex.compiler:digest:jar:3.2.0.3958, com.adobe.flex.compiler:fcsh:jar:3.2.0.3958, com.adobe.flex.compiler:fdb:jar:3.2.0.3958, com.adobe.flex.compiler:flex-compiler-oem:jar:3.2.0.3958, com.adobe.flex.compiler:flex-messaging-common:jar:3.2.0.3958, com.adobe.flex.compiler:mm-velocity:jar:3.2.0.3958, com.adobe.flex.compiler:mxmlc:jar:3.2.0.3958, com.adobe.flex.compiler:optimizer:jar:3.2.0.3958, com.adobe.flex.compiler:swfutils:jar:3.2.0.3958, com.adobe.flex.compiler:xalan:jar:3.2.0.3958, com.adobe.flex.compiler:xercesImpl:jar:3.2.0.3958, com.adobe.flex.compiler:xercesPatch:jar:3.2.0.3958, com.adobe.flex.compiler:xmlParserAPIs:jar:3.2.0.3958, com.adobe.flex.compiler:asdoc:zip:template:3.2.0.3958, org.graniteds:granite-generator:jar:1.1.0, net.sf.saxon:saxon-dom:jar:9.0: Could not transfer artifact com.adobe.flex:compiler:pom:3.2.0.3958 from/to dist.codehaus.org (http://dist.codehaus.org): No connector available to access repository dist.codehaus.org (http://dist.codehaus.org) of type legacy using the available factories WagonRepositoryConnectorFactory

          at org.apache.maven.plugin.internal.DefaultPluginDependenciesResolver.resolve(DefaultPluginD ependenciesResolver.java:215)

          at org.apache.maven.project.DefaultProjectBuildingHelper.resolveExtensionArtifacts(DefaultPr ojectBuildingHelper.java:377)

          at org.apache.maven.project.DefaultProjectBuildingHelper.createProjectRealm(DefaultProjectBu ildingHelper.java:237)

          at org.apache.maven.project.DefaultModelBuildingListener.buildExtensionsAssembled(DefaultMod elBuildingListener.java:106)

          at org.apache.maven.model.building.ModelBuildingEventCatapult$1.fire(ModelBuildingEventCatap ult.java:43)

          at org.apache.maven.model.building.DefaultModelBuilder.fireEvent(DefaultModelBuilder.java:10 41)

          at org.apache.maven.model.building.DefaultModelBuilder.build(DefaultModelBuilder.java:391)

          at org.apache.maven.model.building.DefaultModelBuilder.build(DefaultModelBuilder.java:374)

          at org.apache.maven.project.DefaultProjectBuilder.build(DefaultProjectBuilder.java:536)

          at org.apache.maven.project.DefaultProjectBuilder.build(DefaultProjectBuilder.java:542)

          at org.apache.maven.project.DefaultProjectBuilder.build(DefaultProjectBuilder.java:542)

          at org.apache.maven.project.DefaultProjectBuilder.build(DefaultProjectBuilder.java:328)

          at org.apache.maven.DefaultMaven.collectProjects(DefaultMaven.java:632)

          at org.apache.maven.DefaultMaven.getProjectsForMavenReactor(DefaultMaven.java:581)

          at org.apache.maven.DefaultMaven.doExecute(DefaultMaven.java:233)

          at org.apache.maven.DefaultMaven.execute(DefaultMaven.java:156)

          at org.apache.maven.cli.MavenCli.execute(MavenCli.java:537)

          at org.apache.maven.cli.MavenCli.doMain(MavenCli.java:196)

          at org.apache.maven.cli.MavenCli.main(MavenCli.java:141)

          at sun.reflect.NativeMethodAccessorImpl.invoke0(Native Method)

          at sun.reflect.NativeMethodAccessorImpl.invoke(NativeMethodAccessorImpl.java:39)

          at sun.reflect.DelegatingMethodAccessorImpl.invoke(DelegatingMethodAccessorImpl.java:25)

          at java.lang.reflect.Method.invoke(Method.java:597)

          at org.codehaus.plexus.classworlds.launcher.Launcher.launchEnhanced(Launcher.java:290)

          at org.codehaus.plexus.classworlds.launcher.Launcher.launch(Launcher.java:230)

          at org.codehaus.plexus.classworlds.launcher.Launcher.mainWithExitCode(Launcher.java:409)

          at org.codehaus.plexus.classworlds.launcher.Launcher.main(Launcher.java:352)

      Caused by: org.sonatype.aether.resolution.ArtifactResolutionException: The following artifacts could not be resolved: com.adobe.flex:compiler:pom:3.2.0.3958, com.adobe.flex.compiler:asc:jar:3.2.0.3958, com.adobe.flex.compiler:asdoc:jar:3.2.0.3958, com.adobe.flex.compiler:batik-awt-util:jar:3.2.0.3958, com.adobe.flex.compiler:batik-bridge:jar:3.2.0.3958, com.adobe.flex.compiler:batik-css:jar:3.2.0.3958, com.adobe.flex.compiler:batik-dom:jar:3.2.0.3958, com.adobe.flex.compiler:batik-ext:jar:3.2.0.3958, com.adobe.flex.compiler:batik-gvt:jar:3.2.0.3958, com.adobe.flex.compiler:batik-parser:jar:3.2.0.3958, com.adobe.flex.compiler:batik-script:jar:3.2.0.3958, com.adobe.flex.compiler:batik-svg-dom:jar:3.2.0.3958, com.adobe.flex.compiler:batik-svggen:jar:3.2.0.3958, com.adobe.flex.compiler:batik-transcoder:jar:3.2.0.3958, com.adobe.flex.compiler:batik-util:jar:3.2.0.3958, com.adobe.flex.compiler:batik-xml:jar:3.2.0.3958, com.adobe.flex.compiler:commons-collections:jar:3.2.0.3958, com.adobe.flex.compiler:commons-discovery:jar:3.2.0.3958, com.adobe.flex.compiler:commons-logging:jar:3.2.0.3958, com.adobe.flex.compiler:compc:jar:3.2.0.3958, com.adobe.flex.compiler:copylocale:jar:3.2.0.3958, com.adobe.flex.compiler:digest:jar:3.2.0.3958, com.adobe.flex.compiler:fcsh:jar:3.2.0.3958, com.adobe.flex.compiler:fdb:jar:3.2.0.3958, com.adobe.flex.compiler:flex-compiler-oem:jar:3.2.0.3958, com.adobe.flex.compiler:flex-messaging-common:jar:3.2.0.3958, com.adobe.flex.compiler:mm-velocity:jar:3.2.0.3958, com.adobe.flex.compiler:mxmlc:jar:3.2.0.3958, com.adobe.flex.compiler:optimizer:jar:3.2.0.3958, com.adobe.flex.compiler:swfutils:jar:3.2.0.3958, com.adobe.flex.compiler:xalan:jar:3.2.0.3958, com.adobe.flex.compiler:xercesImpl:jar:3.2.0.3958, com.adobe.flex.compiler:xercesPatch:jar:3.2.0.3958, com.adobe.flex.compiler:xmlParserAPIs:jar:3.2.0.3958, com.adobe.flex.compiler:asdoc:zip:template:3.2.0.3958, org.graniteds:granite-generator:jar:1.1.0, net.sf.saxon:saxon-dom:jar:9.0: Could not transfer artifact com.adobe.flex:compiler:pom:3.2.0.3958 from/to dist.codehaus.org (http://dist.codehaus.org): No connector available to access repository dist.codehaus.org (http://dist.codehaus.org) of type legacy using the available factories WagonRepositoryConnectorFactory

          at org.sonatype.aether.impl.internal.DefaultArtifactResolver.resolve(DefaultArtifactResolver .java:541)

          at org.sonatype.aether.impl.internal.DefaultArtifactResolver.resolveArtifacts(DefaultArtifac tResolver.java:220)

          at org.sonatype.aether.impl.internal.DefaultRepositorySystem.resolveDependencies(DefaultRepo sitorySystem.java:395)

          at org.apache.maven.plugin.internal.DefaultPluginDependenciesResolver.resolve(DefaultPluginD ependenciesResolver.java:207)

          ... 26 more

      Caused by: org.sonatype.aether.transfer.ArtifactTransferException: Could not transfer artifact com.adobe.flex:compiler:pom:3.2.0.3958 from/to dist.codehaus.org (http://dist.codehaus.org): No connector available to access repository dist.codehaus.org (http://dist.codehaus.org) of type legacy using the available factories WagonRepositoryConnectorFactory

          at org.sonatype.aether.impl.internal.DefaultArtifactResolver.resolve(DefaultArtifactResolver .java:471)

          ... 29 more

      Caused by: org.sonatype.aether.transfer.NoRepositoryConnectorException: No connector available to access repository dist.codehaus.org (http://dist.codehaus.org) of type legacy using the available factories WagonRepositoryConnectorFactory

          at org.sonatype.aether.impl.internal.DefaultRemoteRepositoryManager.getRepositoryConnector(D efaultRemoteRepositoryManager.java:387)

          at org.sonatype.aether.impl.internal.DefaultArtifactResolver.resolve(DefaultArtifactResolver .java:456)

          ... 29 more

      [ERROR]     Unknown packaging: swc @ line 5, column 13

      [ERROR]

      [ERROR]

      [ERROR] For more information about the errors and possible solutions, please read the following articles:

      [ERROR] [Help 1] http://cwiki.apache.org/confluence/display/MAVEN/ProjectBuildingException

      [ERROR] [Help 2] http://cwiki.apache.org/confluence/display/MAVEN/PluginResolutionException

        • 1. Re: [ERROR]   Unresolveable build extension
          Michael J Roberts

          What version of Maven is being used for this build?  Could it be that the version of Maven used for artifacts at http://dist.codehaus.org is out of sync with what you are using locally?  Perhaps something like this (http://stackoverflow.com/questions/6006391/how-to-use-a-maven-1-repository-with-maven-2) is happening.  If you are using Maven 3 try dropping back to Maven 2 if possible.

           

          A couple more links which may give you useful info:

           

          Are the com.adobe.flex.compiler artifacts missing?  http://forum.springsource.org/showthread.php?99051-setup-always-failed-maven-dependency-mi ssing

           

          Do you need to point at the maven 2 repository for codehaus?  http://jira.codehaus.org/browse/HAUS-1058

           

          I hope this is useful info.

          • 2. Re: [ERROR]   Unresolveable build extension
            StevenErat Level 1

            Thank you for the assistance.  Ah, yes, I see that there are mentions of 'legacy' and 'artifacts might fail'.    The project's Developer Documentation didn't state which version of Maven is required, so I installed the latest.  I see that those docs mention "m2" as a Maven plugin for Eclipse, perhaps the m2 refers to version 2. I'll try downgrading.  Thanks!

            • 3. Re: [ERROR]   Unresolveable build extension
              StevenErat Level 1

              I wish it could have been *that* easy.   I'll keep working on it, but the problem now is that when using the same command 'mvn package amd', Maven complains that amd is an invalid task.

               

              $ mvn package amd

              [INFO] Scanning for projects...

              [INFO] Reactor build order:

              [INFO]   Adobe Flex PMD

              [INFO]   Adobe Flex PMD Java Parent

              [INFO]   As3 Maven plugin Utils

              [INFO]   As3 Parser API

              [INFO]   Adobe Flex PMD RuleSet test resources

              [INFO]   Adobe Flex PMD Files

              [INFO]   As3 Parser

              [INFO]   Adobe Flex PMD RuleSet API

              [INFO]   Adobe Flex PMD RuleSet

              [INFO]   Adobe Flex PMD Core

              [INFO]   Adobe Flex PMD Maven plugin

              [INFO]   Adobe Flex CPD (Copy and Past Detector)

              [INFO]   Adobe Flex CPD Maven plugin

              [INFO]   Adobe Flex Metrics

              [INFO]   Adobe Flex Metrics Maven plugin

              [INFO]   Adobe Flex PMD Flex Parent

              [INFO]   FlexUnit theme

              [INFO]   Adobe Flex PMD Flex lib

              [INFO]   Adobe Flex PMD Ruleset creator

              [INFO]   Adobe Flex PMD Violations viewer

              [INFO]   Adobe Flex PMD Flex/Java Parent

              [INFO]   Adobe Flex PMD Mac OSX Automator workflow

              [INFO]   Adobe Flex PMD Ant task

              [INFO]   Adobe Flex PMD Command line API

              [INFO]   Adobe Flex PMD Command line

              [INFO]   Adobe Flex CPD Ant task

              [INFO]   Adobe Flex CPD Command line

              [INFO]   Adobe Flex Metrics Ant task

              [INFO]   Adobe Flex Metrics command line

              [INFO]   Adobe Flex PMD All-in-one bundle

              [INFO] ------------------------------------------------------------------------

              [ERROR] BUILD FAILURE

              [INFO] ------------------------------------------------------------------------

              [INFO] Invalid task 'amd': you must specify a valid lifecycle phase, or a goal in the format plugin:goal or pluginGroupId:pluginArtifactId:pluginVersion:goal

              [INFO] ------------------------------------------------------------------------

              [INFO] For more information, run Maven with the -e switch

              [INFO] ------------------------------------------------------------------------

              [INFO] Total time: < 1 second

              [INFO] Finished at: Mon Jul 30 14:44:20 EDT 2012

              [INFO] Final Memory: 4M/81M

              [INFO] ------------------------------------------------------------------------

              • 4. Re: [ERROR]   Unresolveable build extension
                StevenErat Level 1

                I should add that the last problem was encountered after downgrading from 3.0x to 2.2.1.

                 

                mvn --version

                Apache Maven 2.2.1 (r801777; 2009-08-06 15:16:01-0400)

                Java version: 1.6.0_33

                Java home: /System/Library/Java/JavaVirtualMachines/1.6.0.jdk/Contents/Home

                Default locale: en_US, platform encoding: MacRoman

                OS name: "mac os x" version: "10.7.4" arch: "x86_64" Family: "mac"

                • 5. Re: [ERROR]   Unresolveable build extension
                  Michael J Roberts Level 2

                  You should be able to see all of the options maven 2 supports with "mvn --help".  I think you are simply missing a dash in front of your amd option.  Try "mvn package -amd".

                  • 6. Re: [ERROR]   Unresolveable build extension
                    StevenErat Level 1

                    @Michael: Thank you!  I'm a Maven n00b.  This time FlexPMD project gets a lot farther when building with Maven 2.x, and when it encounters missing dependencies, it actually outputs how to obtain and install them.  That is soo much better than when I ran it it with Maven 3.

                     

                     

                    Example:

                     

                    [INFO] Unable to find resource 'com.adobe.cairngorm:cairngorm:swc:2.2.1' in repository nexus.codehaus (https://nexus.codehaus.org/content/repositories/releases)

                    [INFO] ------------------------------------------------------------------------

                    [ERROR] BUILD ERROR

                    [INFO] ------------------------------------------------------------------------

                    [INFO] Failed to resolve artifact.

                     

                    Missing:

                    ----------

                    1) com.adobe.flex.framework:datavisualization:swc:3.2.0.3958

                     

                      Try downloading the file manually from the project website.

                     

                      Then, install it using the command:

                          mvn install:install-file -DgroupId=com.adobe.flex.framework -DartifactId=datavisualization -Dversion=3.2.0.3958 -Dpackaging=swc -Dfile=/path/to/file

                     

                      Alternatively, if you host your own repository you can deploy the file there:

                          mvn deploy:deploy-file -DgroupId=com.adobe.flex.framework -DartifactId=datavisualization -Dversion=3.2.0.3958 -Dpackaging=swc -Dfile=/path/to/file -Durl=[url] -DrepositoryId=[id]

                     

                      Path to dependency:

                          1) com.adobe.ac:flex-pmd-flex-lib:swc:1.3-SNAPSHOT

                          2) com.adobe.flex.framework:datavisualization:swc:3.2.0.3958

                     

                    2) com.adobe.flex.framework:datavisualization:rb.swc:en_US:3.2.0.3958

                     

                      Try downloading the file manually from the project website.

                     

                      Then, install it using the command:

                          mvn install:install-file -DgroupId=com.adobe.flex.framework -DartifactId=datavisualization -Dversion=3.2.0.3958 -Dclassifier=en_US -Dpackaging=rb.swc -Dfile=/path/to/file

                     

                      Alternatively, if you host your own repository you can deploy the file there:

                          mvn deploy:deploy-file -DgroupId=com.adobe.flex.framework -DartifactId=datavisualization -Dversion=3.2.0.3958 -Dclassifier=en_US -Dpackaging=rb.swc -Dfile=/path/to/file -Durl=[url] -DrepositoryId=[id]

                     

                      Path to dependency:

                          1) com.adobe.ac:flex-pmd-flex-lib:swc:1.3-SNAPSHOT

                          2) com.adobe.flex.framework:datavisualization:rb.swc:en_US:3.2.0.3958

                     

                    3) com.adobe.cairngorm:event-source:swc:1.1

                     

                      Try downloading the file manually from the project website.

                     

                      Then, install it using the command:

                          mvn install:install-file -DgroupId=com.adobe.cairngorm -DartifactId=event-source -Dversion=1.1 -Dpackaging=swc -Dfile=/path/to/file

                     

                      Alternatively, if you host your own repository you can deploy the file there:

                          mvn deploy:deploy-file -DgroupId=com.adobe.cairngorm -DartifactId=event-source -Dversion=1.1 -Dpackaging=swc -Dfile=/path/to/file -Durl=[url] -DrepositoryId=[id]

                     

                      Path to dependency:

                          1) com.adobe.ac:flex-pmd-flex-lib:swc:1.3-SNAPSHOT

                          2) com.adobe.cairngorm:event-source:swc:1.1

                     

                    4) com.adobe.cairngorm:cairngorm:swc:2.2.1

                     

                      Try downloading the file manually from the project website.

                     

                      Then, install it using the command:

                          mvn install:install-file -DgroupId=com.adobe.cairngorm -DartifactId=cairngorm -Dversion=2.2.1 -Dpackaging=swc -Dfile=/path/to/file

                     

                      Alternatively, if you host your own repository you can deploy the file there:

                          mvn deploy:deploy-file -DgroupId=com.adobe.cairngorm -DartifactId=cairngorm -Dversion=2.2.1 -Dpackaging=swc -Dfile=/path/to/file -Durl=[url] -DrepositoryId=[id]

                     

                      Path to dependency:

                          1) com.adobe.ac:flex-pmd-flex-lib:swc:1.3-SNAPSHOT

                          2) com.adobe.cairngorm:cairngorm:swc:2.2.1

                     

                    ----------

                    4 required artifacts are missing.

                     

                    for artifact:

                      com.adobe.ac:flex-pmd-flex-lib:swc:1.3-SNAPSHOT

                     

                    from the specified remote repositories:

                      flexmojos-repository (http://repository.sonatype.org/content/groups/public/),

                      central (http://repo1.maven.org/maven2),

                      dist.codehaus.org (http://dist.codehaus.org/),

                      nexus.codehaus (https://nexus.codehaus.org/content/repositories/releases),

                      maven2-repository.dev.java.net (http://download.java.net/maven/2/),

                      apache (http://cvs.apache.org/repository/),

                      flex-mojos (http://repository.sonatype.org/content/groups/flexgroup)

                     

                     

                     

                    [INFO] ------------------------------------------------------------------------

                    [INFO] For more information, run Maven with the -e switch

                    [INFO] ------------------------------------------------------------------------

                    [INFO] Total time: 10 minutes 30 seconds

                    [INFO] Finished at: Wed Aug 01 11:39:21 EDT 2012

                    [INFO] Final Memory: 67M/123M

                    [INFO] ------------------------------------------------------------------------

                    • 7. Re: [ERROR]   Unresolveable build extension
                      StevenErat Level 1

                      For everyone else, I'm cross referencing this related forum thread: http://forums.adobe.com/thread/780055

                       

                      There, the poster used Maven 2.x and encountered the same missing dependencies as above, however no solution was supplied in any reply.  Although, the last poster in that thread commented that for the errors regarding "legacy" dependencies when using Maven 3.x are resolved by using Maven 2.x because Maven 3 doesn't support legacy repos.

                      • 8. Re: [ERROR]   Unresolveable build extension
                        StevenErat Level 1

                        After contacting the lead architect for the FlexPMD project, he recommended that I build from flex-pmd-java-parent instead of flex-pmd-parent.  Having made that change the build succeeded with Maven 2.

                         

                        I'll point out that the Developer Documentation does mention the version of Maven required, and it suggests building form flex-pmd-parent rather than flex-pmd-java-parent.

                         

                        Here's the tail of my build results showing success:

                         

                         

                        [INFO] [jar:jar {execution: default-jar}]

                        [INFO] Building jar: /opt/flexpmd/trunk/flex-pmd-metrics-maven-plugin/target/flex-pmd-metrics-maven-plugin-1.3 -SNAPSHOT.jar

                        [INFO] [plugin:addPluginArtifactMetadata {execution: default-addPluginArtifactMetadata}]

                        [INFO] [license:check {execution: default}]

                        [INFO] Checking licenses...

                        [INFO]

                        [INFO]

                        [INFO] ------------------------------------------------------------------------

                        [INFO] Reactor Summary:

                        [INFO] ------------------------------------------------------------------------

                        [INFO] Adobe Flex PMD Java Parent ............................ SUCCESS [2.930s]

                        [INFO] As3 Parser API ........................................ SUCCESS [2.847s]

                        [INFO] As3 Maven plugin Utils ................................ SUCCESS [0.791s]

                        [INFO] Adobe Flex PMD RuleSet test resources ................. SUCCESS [1.482s]

                        [INFO] Adobe Flex PMD Files .................................. SUCCESS [3.772s]

                        [INFO] As3 Parser ............................................ SUCCESS [1.993s]

                        [INFO] Adobe Flex PMD RuleSet API ............................ SUCCESS [4.163s]

                        [INFO] Adobe Flex PMD RuleSet ................................ SUCCESS [23.814s]

                        [INFO] Adobe Flex CPD (Copy and Past Detector) ............... SUCCESS [2.668s]

                        [INFO] Adobe Flex CPD Ant task ............................... SUCCESS [9.320s]

                        [INFO] Adobe Flex PMD Core ................................... SUCCESS [9.003s]

                        [INFO] Adobe Flex CPD Maven plugin ........................... SUCCESS [3.718s]

                        [INFO] Adobe Flex PMD Command line API ....................... SUCCESS [2.308s]

                        [INFO] Adobe Flex CPD Command line ........................... SUCCESS [4.136s]

                        [INFO] Adobe Flex PMD Ant task ............................... SUCCESS [11.027s]

                        [INFO] Adobe Flex PMD Maven plugin ........................... SUCCESS [12.468s]

                        [INFO] Adobe Flex PMD Command line ........................... SUCCESS [5.865s]

                        [INFO] Adobe Flex Metrics .................................... SUCCESS [5.169s]

                        [INFO] Adobe Flex Metrics command line ....................... SUCCESS [3.986s]

                        [INFO] Adobe Flex Metrics Ant task ........................... SUCCESS [4.423s]

                        [INFO] Adobe Flex Metrics Maven plugin ....................... SUCCESS [7.796s]

                        [INFO] ------------------------------------------------------------------------

                        [INFO] ------------------------------------------------------------------------

                        [INFO] BUILD SUCCESSFUL

                        [INFO] ------------------------------------------------------------------------

                        [INFO] Total time: 2 minutes 5 seconds

                        [INFO] Finished at: Thu Aug 02 10:07:27 EDT 2012

                        [INFO] Final Memory: 49M/101M

                        [INFO] ------------------------------------------------------------------------