1 Reply Latest reply on Jun 21, 2016 5:11 AM by Bandicood

    PGB: Execution failed for task ':processReleaseResources' on Android

    Bandicood

      Hey,

       

      currently i get this error with the Android build process:

      ==============================

      Build Date: 2016-06-20 12:11:11 +0000

      :preBuild UP-TO-DATE

      :preReleaseBuild UP-TO-DATE

      :checkReleaseManifest

      :preDebugBuild UP-TO-DATE

      :CordovaLib:preBuild UP-TO-DATE

      :CordovaLib:preDebugBuild UP-TO-DATE

      :CordovaLib:compileDebugNdk UP-TO-DATE

      :CordovaLib:compileLint

      :CordovaLib:copyDebugLint UP-TO-DATE

      :CordovaLib:mergeDebugProguardFiles

      :CordovaLib:packageDebugRenderscript UP-TO-DATE

      :CordovaLib:checkDebugManifest

      :CordovaLib:prepareDebugDependencies

      :CordovaLib:compileDebugRenderscript

      :CordovaLib:generateDebugResValues

      :CordovaLib:generateDebugResources

      :CordovaLib:packageDebugResources

      :CordovaLib:compileDebugAidl

      :CordovaLib:generateDebugBuildConfig

      :CordovaLib:generateDebugAssets UP-TO-DATE

      :CordovaLib:mergeDebugAssets

      :CordovaLib:processDebugManifest

      :CordovaLib:processDebugResources

      :CordovaLib:generateDebugSources

      :CordovaLib:compileDebugJavaWithJavacNote: Some input files use or override a deprecated API.

      Note: Recompile with -Xlint:deprecation for details.

       

      :CordovaLib:processDebugJavaRes UP-TO-DATE

      :CordovaLib:transformResourcesWithMergeJavaResForDebug

      :CordovaLib:transformClassesAndResourcesWithSyncLibJarsForDebug

      :CordovaLib:mergeDebugJniLibFolders

      :CordovaLib:transformNative_libsWithMergeJniLibsForDebug

      :CordovaLib:transformNative_libsWithSyncJniLibsForDebug

      :CordovaLib:bundleDebug

      :CordovaLib:preReleaseBuild UP-TO-DATE

      :CordovaLib:compileReleaseNdk UP-TO-DATE

      :CordovaLib:copyReleaseLint UP-TO-DATE

      :CordovaLib:mergeReleaseProguardFiles

      :CordovaLib:packageReleaseRenderscript UP-TO-DATE

      :CordovaLib:checkReleaseManifest

      :CordovaLib:prepareReleaseDependencies

      :CordovaLib:compileReleaseRenderscript

      :CordovaLib:generateReleaseResValues

      :CordovaLib:generateReleaseResources

      :CordovaLib:packageReleaseResources

      :CordovaLib:compileReleaseAidl

      :CordovaLib:generateReleaseBuildConfig

      :CordovaLib:generateReleaseAssets UP-TO-DATE

      :CordovaLib:mergeReleaseAssets

      :CordovaLib:processReleaseManifest

      :CordovaLib:processReleaseResources

      :CordovaLib:generateReleaseSources

      :CordovaLib:compileReleaseJavaWithJavacNote: Some input files use or override a deprecated API.

      Note: Recompile with -Xlint:deprecation for details.

       

      :CordovaLib:processReleaseJavaRes UP-TO-DATE

      :CordovaLib:transformResourcesWithMergeJavaResForRelease

      :CordovaLib:transformClassesAndResourcesWithSyncLibJarsForRelease

      :CordovaLib:mergeReleaseJniLibFolders

      :CordovaLib:transformNative_libsWithMergeJniLibsForRelease

      :CordovaLib:transformNative_libsWithSyncJniLibsForRelease

      :CordovaLib:bundleRelease

      :prepareComAndroidSupportSupportV42300Library

      :prepareComGoogleAndroidGmsPlayServicesAnalytics840Library

      :prepareComGoogleAndroidGmsPlayServicesBasement840Library

      :prepareProjectCordovaLibUnspecifiedReleaseLibrary

      :prepareReleaseDependencies

      :compileReleaseAidl

      :compileReleaseRenderscript

      :generateReleaseBuildConfig

      :generateReleaseAssets UP-TO-DATE

      :mergeReleaseAssets

      :generateReleaseResValues

      :generateReleaseResources

      :mergeReleaseResources

      :processReleaseManifest

      :processReleaseResources FAILED

       

      FAILURE: Build failed with an exception.

       

      * What went wrong:

      Execution failed for task ':processReleaseResources'.

      > com.android.ide.common.process.ProcessException: org.gradle.process.internal.ExecException: Process 'command '/android-sdk/build-tools/23.0.1/aapt'' finished with non-zero exit value 1

       

      * Try:

      Run with --stacktrace option to get the stack trace. Run with --info or --debug option to get more log output.

       

      BUILD FAILED

       

      Total time: 6.42 secs

      undefined

      ==============================

       

      Sadly i don't know that to do. Could you help me out here?

       

      APP ID: 2063515 !