2 Replies Latest reply on Jul 20, 2016 3:48 PM by ryanskihead

    Android Build Failed. XWalkCordova errors in log.

    danielw66507254 Level 1

      Hello.

       

      Whenever i try to build my project for android i get the error message:

       

      Oh geez. Your build failed. Sorry, but a problem occurred on the build server

       

      Looking at the Log, there are about a hundred errors in Java complication to do with XWalkCordova - mostly in that they do not exist in one form or another.

       

      I will post the Log at the bottom.

       

      I appreciate any help at this stage.

       

      Thanks

       

       

      LOG:

       

      Build Date: 2016-07-20 14:19:30 +0000

      --------------------------------------------------------------------------------

      PLUGIN OUTPUT

      --------------------------------------------------------------------------------

      Fetching plugin "cordova-plugin-crosswalk-webview" via npm

      Installing "cordova-plugin-crosswalk-webview" at "1.8.0" for android

      Fetching plugin "cordova-plugin-whitelist" via npm

      Installing "cordova-plugin-whitelist" at "1.2.2" for android

       

        This plugin is only applicable for versions of cordova-android greater than 4.0. If you have a previous platform version, you do *not* need this plugin since the whitelist will be built in.

      --------------------------------------------------------------------------------

      COMPILE OUTPUT

      --------------------------------------------------------------------------------

      Executing: ant debug -f /project/build.xml

      Buildfile: /project/build.xml

      Buildfile: /project/build.xml

       

      -check-env:

      [checkenv] Android SDK Tools Revision 25.1.7

       

      -setup:

        [echo] Project Name: .AsteroidsAhead

        [gettype] Project Type: Application

       

      -pre-clean:

       

      clean:

      [getlibpath] Library dependencies:

      [getlibpath]

      [getlibpath] ------------------

      [getlibpath] Ordered libraries:

       

      -set-mode-check:

       

      -set-debug-files:

       

      -check-env:

      [checkenv] Android SDK Tools Revision 25.1.7

       

      -setup:

        [echo] Project Name: .AsteroidsAhead

        [gettype] Project Type: Application

       

      -set-debug-mode:

       

      -debug-obfuscation-check:

       

      -pre-build:

       

      -build-setup:

       

      nodeps:

       

      -check-env:

      [checkenv] Android SDK Tools Revision 25.1.7

       

      -setup:

        [echo] Project Name: .AsteroidsAhead

        [gettype] Project Type: Android Library

      [getbuildtools] Using latest Build Tools: 23.0.1

       

      -pre-clean:

       

      clean:

        [echo] Resolving Build Target for .AsteroidsAhead...

       

      BUILD SUCCESSFUL

      Total time: 1 second

      [gettarget] Project Target: Android 5.1.1

      [gettarget] API level: 22

        [echo] ----------

        [echo] Creating output directories if needed...

        [mkdir] Created dir: /project/bin

        [mkdir] Created dir: /project/bin/res

        [mkdir] Created dir: /project/bin/rsObj

        [mkdir] Created dir: /project/bin/rsLibs

        [mkdir] Created dir: /project/gen

        [mkdir] Created dir: /project/bin/classes

        [mkdir] Created dir: /project/bin/dexedLibs

        [echo] ----------

        [echo] Resolving Dependencies for .AsteroidsAhead...

      [dependency] Library dependencies:

      [dependency]

      [dependency] ------------------

      [dependency] Ordered libraries:

      [dependency]

      [dependency] ------------------

        [echo] ----------

        [echo] Building Libraries with 'debug'...

       

      nodeps:

       

      -set-mode-check:

       

      -set-debug-files:

       

      -check-env:

      [checkenv] Android SDK Tools Revision 25.1.7

       

      -setup:

        [echo] Project Name: .AsteroidsAhead

        [gettype] Project Type: Android Library

       

      -set-debug-mode:

       

      -debug-obfuscation-check:

       

      -pre-build:

       

      -build-setup:

      [getbuildtools] Using latest Build Tools: 23.0.1

        [echo] Resolving Build Target for .AsteroidsAhead...

      [gettarget] Project Target: Android 5.1.1

      [gettarget] API level: 22

        [echo] ----------

        [echo] Creating output directories if needed...

        [mkdir] Created dir: /project/CordovaLib/res

        [mkdir] Created dir: /project/CordovaLib/libs

        [mkdir] Created dir: /project/CordovaLib/bin

        [mkdir] Created dir: /project/CordovaLib/bin/res

        [mkdir] Created dir: /project/CordovaLib/bin/rsObj

        [mkdir] Created dir: /project/CordovaLib/bin/rsLibs

        [mkdir] Created dir: /project/CordovaLib/gen

        [mkdir] Created dir: /project/CordovaLib/bin/classes

        [mkdir] Created dir: /project/CordovaLib/bin/dexedLibs

        [echo] ----------

        [echo] Resolving Dependencies for .AsteroidsAhead...

      [dependency] Library dependencies:

      [dependency] No Libraries

      [dependency]

      [dependency] ------------------

       

      -code-gen:

      [mergemanifest] Merging AndroidManifest files into one.

      [mergemanifest] Manifest merger disabled. Using project manifest only.

        [echo] Handling aidl files...

        [aidl] No AIDL files to compile.

        [echo] ----------

        [echo] Handling RenderScript files...

        [echo] ----------

        [echo] Handling Resources...

        [aapt] Generating resource IDs...

        [echo] ----------

        [echo] Handling BuildConfig class...

      [buildconfig] Generating BuildConfig class.

       

      -pre-compile:

       

      -compile:

        [javac] Compiling 36 source files to /project/CordovaLib/bin/classes

        [javac] Note: Some input files use or override a deprecated API.

        [javac] Note: Recompile with -Xlint:deprecation for details.

        [echo] Creating library output jar file...

        [jar] Building jar: /project/CordovaLib/bin/classes.jar

       

      -post-compile:

       

      -obfuscate:

       

      -dex:

        [echo] Library project: do not convert bytecode...

       

      -crunch:

        [crunch] Crunching PNG Files in source dir: /project/CordovaLib/res

        [crunch] To destination dir: /project/CordovaLib/bin/res

        [crunch] Crunched 0 PNG files to update cache

       

      -package-resources:

        [echo] Library project: do not package resources...

       

      -package:

        [echo] Library project: do not package apk...

       

      -post-package:

       

      -do-debug:

        [echo] Library project: do not create apk...

      [propertyfile] Creating new property file: /project/CordovaLib/bin/build.prop

      [propertyfile] Updating property file: /project/CordovaLib/bin/build.prop

      [propertyfile] Updating property file: /project/CordovaLib/bin/build.prop

      [propertyfile] Updating property file: /project/CordovaLib/bin/build.prop

       

      -post-build:

       

      debug:

       

      -code-gen:

      [mergemanifest] Merging AndroidManifest files into one.

      [mergemanifest] Manifest merger disabled. Using project manifest only.

        [echo] Handling aidl files...

        [aidl] No AIDL files to compile.

        [echo] ----------

        [echo] Handling RenderScript files...

        [echo] ----------

        [echo] Handling Resources...

        [aapt] Generating resource IDs...

        [echo] ----------

        [echo] Handling BuildConfig class...

      [buildconfig] Generating BuildConfig class.

       

      -pre-compile:

       

      -compile:

        [javac] Compiling 12 source files to /project/bin/classes

        [javac] /project/src/org/crosswalk/engine/XWalkCordovaClientCertRequest.java:22: error: package org.xwalk.core does not exist

        [javac] import org.xwalk.core.ClientCertRequest;

        [javac] ^

        [javac] /project/src/org/crosswalk/engine/XWalkCordovaClientCertRequest.java:31: error: cannot find symbol

        [javac] private final ClientCertRequest request;

        [javac] ^

        [javac] symbol: class ClientCertRequest

        [javac] location: class XWalkCordovaClientCertRequest

        [javac] /project/src/org/crosswalk/engine/XWalkCordovaClientCertRequest.java:33: error: cannot find symbol

        [javac] public XWalkCordovaClientCertRequest(ClientCertRequest request) {

        [javac] ^

        [javac] symbol: class ClientCertRequest

        [javac] location: class XWalkCordovaClientCertRequest

        [javac] /project/src/org/crosswalk/engine/XWalkCordovaCookieManager.java:22: error: package org.xwalk.core does not exist

        [javac] import org.xwalk.core.XWalkCookieManager;

        [javac] ^

        [javac] /project/src/org/crosswalk/engine/XWalkCordovaCookieManager.java:26: error: cannot find symbol

        [javac] protected XWalkCookieManager cookieManager = null;

        [javac] ^

        [javac] symbol: class XWalkCookieManager

        [javac] location: class XWalkCordovaCookieManager

        [javac] /project/src/org/crosswalk/engine/XWalkCordovaHttpAuthHandler.java:22: error: package org.xwalk.core does not exist

        [javac] import org.xwalk.core.XWalkHttpAuthHandler;

        [javac] ^

        [javac] /project/src/org/crosswalk/engine/XWalkCordovaHttpAuthHandler.java:30: error: cannot find symbol

        [javac] private final XWalkHttpAuthHandler handler;

        [javac] ^

        [javac] symbol: class XWalkHttpAuthHandler

        [javac] location: class XWalkCordovaHttpAuthHandler

        [javac] /project/src/org/crosswalk/engine/XWalkCordovaHttpAuthHandler.java:32: error: cannot find symbol

        [javac] public XWalkCordovaHttpAuthHandler(XWalkHttpAuthHandler handler) {

        [javac] ^

        [javac] symbol: class XWalkHttpAuthHandler

        [javac] location: class XWalkCordovaHttpAuthHandler

        [javac] /project/src/org/crosswalk/engine/XWalkCordovaResourceClient.java:32: error: package org.xwalk.core does not exist

        [javac] import org.xwalk.core.ClientCertRequest;

        [javac] ^

        [javac] /project/src/org/crosswalk/engine/XWalkCordovaResourceClient.java:33: error: package org.xwalk.core does not exist

        [javac] import org.xwalk.core.XWalkHttpAuthHandler;

        [javac] ^

        [javac] /project/src/org/crosswalk/engine/XWalkCordovaResourceClient.java:34: error: package org.xwalk.core does not exist

        [javac] import org.xwalk.core.XWalkResourceClient;

        [javac] ^

        [javac] /project/src/org/crosswalk/engine/XWalkCordovaResourceClient.java:35: error: package org.xwalk.core does not exist

        [javac] import org.xwalk.core.XWalkView;

        [javac] ^

        [javac] /project/src/org/crosswalk/engine/XWalkCordovaResourceClient.java:40: error: cannot find symbol

        [javac] public class XWalkCordovaResourceClient extends XWalkResourceClient {

        [javac] ^

        [javac] symbol: class XWalkResourceClient

        [javac] /project/src/org/crosswalk/engine/XWalkWebViewEngine.java:47: error: package org.xwalk.core does not exist

        [javac] import org.xwalk.core.XWalkActivityDelegate;

        [javac] ^

        [javac] /project/src/org/crosswalk/engine/XWalkWebViewEngine.java:48: error: package org.xwalk.core does not exist

        [javac] import org.xwalk.core.XWalkNavigationHistory;

        [javac] ^

        [javac] /project/src/org/crosswalk/engine/XWalkWebViewEngine.java:49: error: package org.xwalk.core does not exist

        [javac] import org.xwalk.core.XWalkView;

        [javac] ^

        [javac] /project/src/org/crosswalk/engine/XWalkWebViewEngine.java:50: error: package org.xwalk.core does not exist

        [javac] import org.xwalk.core.XWalkGetBitmapCallback;

        [javac] ^

        [javac] /project/src/org/crosswalk/engine/XWalkCordovaResourceClient.java:60: error: cannot find symbol

        [javac] public void onReceivedLoadError(XWalkView view, int errorCode, String description,

        [javac] ^

        [javac] symbol: class XWalkView

        [javac] location: class XWalkCordovaResourceClient

        [javac] /project/src/org/crosswalk/engine/XWalkCordovaResourceClient.java:68: error: cannot find symbol

        [javac] public WebResourceResponse shouldInterceptLoadRequest(XWalkView view, String url) {

        [javac] ^

        [javac] symbol: class XWalkView

        [javac] location: class XWalkCordovaResourceClient

        [javac] /project/src/org/crosswalk/engine/XWalkCordovaResourceClient.java:98: error: cannot find symbol

        [javac] public boolean shouldOverrideUrlLoading(XWalkView view, String url) {

        [javac] ^

        [javac] symbol: class XWalkView

        [javac] location: class XWalkCordovaResourceClient

        [javac] /project/src/org/crosswalk/engine/XWalkCordovaResourceClient.java:111: error: cannot find symbol

        [javac] public void onReceivedSslError(XWalkView view, ValueCallback<Boolean> callback, SslError error) {

        [javac] ^

        [javac] symbol: class XWalkView

        [javac] location: class XWalkCordovaResourceClient

        [javac] /project/src/org/crosswalk/engine/XWalkCordovaResourceClient.java:132: error: cannot find symbol

        [javac] public void onReceivedHttpAuthRequest(XWalkView view, XWalkHttpAuthHandler handler,

        [javac] ^

        [javac] symbol: class XWalkView

        [javac] location: class XWalkCordovaResourceClient

        [javac] /project/src/org/crosswalk/engine/XWalkCordovaResourceClient.java:132: error: cannot find symbol

        [javac] public void onReceivedHttpAuthRequest(XWalkView view, XWalkHttpAuthHandler handler,

        [javac] ^

        [javac] symbol: class XWalkHttpAuthHandler

        [javac] location: class XWalkCordovaResourceClient

        [javac] /project/src/org/crosswalk/engine/XWalkCordovaResourceClient.java:148: error: cannot find symbol

        [javac] public void onReceivedClientCertRequest(XWalkView view, ClientCertRequest request) {

        [javac] ^

        [javac] symbol: class XWalkView

        [javac] location: class XWalkCordovaResourceClient

        [javac] /project/src/org/crosswalk/engine/XWalkCordovaResourceClient.java:148: error: cannot find symbol

        [javac] public void onReceivedClientCertRequest(XWalkView view, ClientCertRequest request) {

        [javac] ^

        [javac] symbol: class ClientCertRequest

        [javac] location: class XWalkCordovaResourceClient

        [javac] /project/src/org/crosswalk/engine/XWalkCordovaView.java:4: error: package org.xwalk.core does not exist

        [javac] import org.xwalk.core.XWalkPreferences;

        [javac] ^

        [javac] /project/src/org/crosswalk/engine/XWalkCordovaView.java:5: error: package org.xwalk.core does not exist

        [javac] import org.xwalk.core.XWalkResourceClient;

        [javac] ^

        [javac] /project/src/org/crosswalk/engine/XWalkCordovaView.java:6: error: package org.xwalk.core does not exist

        [javac] import org.xwalk.core.XWalkUIClient;

        [javac] ^

        [javac] /project/src/org/crosswalk/engine/XWalkCordovaView.java:7: error: package org.xwalk.core does not exist

        [javac] import org.xwalk.core.XWalkView;

        [javac] ^

        [javac] /project/src/org/crosswalk/engine/XWalkCordovaView.java:22: error: cannot find symbol

        [javac] public class XWalkCordovaView extends XWalkView implements CordovaWebViewEngine.EngineView {

        [javac] ^

        [javac] symbol: class XWalkView

        [javac] /project/src/org/crosswalk/engine/XWalkWebViewEngine.java:72: error: cannot find symbol

        [javac] protected XWalkActivityDelegate activityDelegate;

        [javac] ^

        [javac] symbol: class XWalkActivityDelegate

        [javac] location: class XWalkWebViewEngine

        [javac] /project/src/org/crosswalk/engine/XWalkWebViewEngine.java:212: error: cannot find symbol

        [javac] private static void exposeJsInterface(XWalkView webView, CordovaBridge bridge) {

        [javac] ^

        [javac] symbol: class XWalkView

        [javac] location: class XWalkWebViewEngine

        [javac] /project/src/org/crosswalk/engine/XWalkCordovaUiClient.java:31: error: package org.xwalk.core does not exist

        [javac] import org.xwalk.core.XWalkJavascriptResult;

        [javac] ^

        [javac] /project/src/org/crosswalk/engine/XWalkCordovaUiClient.java:32: error: package org.xwalk.core does not exist

        [javac] import org.xwalk.core.XWalkUIClient;

        [javac] ^

        [javac] /project/src/org/crosswalk/engine/XWalkCordovaUiClient.java:33: error: package org.xwalk.core does not exist

        [javac] import org.xwalk.core.XWalkView;

        [javac] ^

        [javac] /project/src/org/crosswalk/engine/XWalkCordovaUiClient.java:35: error: cannot find symbol

        [javac] public class XWalkCordovaUiClient extends XWalkUIClient {

        [javac] ^

        [javac] symbol: class XWalkUIClient

        [javac] /project/src/org/crosswalk/engine/XWalkCordovaView.java:73: error: cannot find symbol

        [javac] public void setResourceClient(XWalkResourceClient client) {

        [javac] ^

        [javac] symbol: class XWalkResourceClient

        [javac] location: class XWalkCordovaView

        [javac] /project/src/org/crosswalk/engine/XWalkCordovaView.java:82: error: cannot find symbol

        [javac] public void setUIClient(XWalkUIClient client) {

        [javac] ^

        [javac] symbol: class XWalkUIClient

        [javac] location: class XWalkCordovaView

        [javac] /project/src/org/crosswalk/engine/XWalkCordovaUiClient.java:49: error: cannot find symbol

        [javac] public boolean onJavascriptModalDialog(XWalkView view, JavascriptMessageType type, String url,

        [javac] ^

        [javac] symbol: class XWalkView

        [javac] location: class XWalkCordovaUiClient

        [javac] /project/src/org/crosswalk/engine/XWalkCordovaUiClient.java:49: error: cannot find symbol

        [javac] public boolean onJavascriptModalDialog(XWalkView view, JavascriptMessageType type, String url,

        [javac] ^

        [javac] symbol: class JavascriptMessageType

        [javac] location: class XWalkCordovaUiClient

        [javac] /project/src/org/crosswalk/engine/XWalkCordovaUiClient.java:50: error: cannot find symbol

        [javac] String message, String defaultValue, XWalkJavascriptResult result) {

        [javac] ^

        [javac] symbol: class XWalkJavascriptResult

        [javac] location: class XWalkCordovaUiClient

        [javac] /project/src/org/crosswalk/engine/XWalkCordovaUiClient.java:71: error: cannot find symbol

        [javac] public boolean onJsAlert(XWalkView view, String url, String message,

        [javac] ^

        [javac] symbol: class XWalkView

        [javac] location: class XWalkCordovaUiClient

        [javac] /project/src/org/crosswalk/engine/XWalkCordovaUiClient.java:72: error: cannot find symbol

        [javac] final XWalkJavascriptResult result) {

        [javac] ^

        [javac] symbol: class XWalkJavascriptResult

        [javac] location: class XWalkCordovaUiClient

        [javac] /project/src/org/crosswalk/engine/XWalkCordovaUiClient.java:89: error: cannot find symbol

        [javac] public boolean onJsConfirm(XWalkView view, String url, String message,

        [javac] ^

        [javac] symbol: class XWalkView

        [javac] location: class XWalkCordovaUiClient

        [javac] /project/src/org/crosswalk/engine/XWalkCordovaUiClient.java:90: error: cannot find symbol

        [javac] final XWalkJavascriptResult result) {

        [javac] ^

        [javac] symbol: class XWalkJavascriptResult

        [javac] location: class XWalkCordovaUiClient

        [javac] /project/src/org/crosswalk/engine/XWalkCordovaUiClient.java:112: error: cannot find symbol

        [javac] public boolean onJsPrompt(XWalkView view, String origin, String message, String defaultValue,

        [javac] ^

        [javac] symbol: class XWalkView

        [javac] location: class XWalkCordovaUiClient

        [javac] /project/src/org/crosswalk/engine/XWalkCordovaUiClient.java:113: error: cannot find symbol

        [javac] final XWalkJavascriptResult result) {

        [javac] ^

        [javac] symbol: class XWalkJavascriptResult

        [javac] location: class XWalkCordovaUiClient

        [javac] /project/src/org/crosswalk/engine/XWalkCordovaUiClient.java:144: error: cannot find symbol

        [javac] public void onPageLoadStarted(XWalkView view, String url) {

        [javac] ^

        [javac] symbol: class XWalkView

        [javac] location: class XWalkCordovaUiClient

        [javac] /project/src/org/crosswalk/engine/XWalkCordovaUiClient.java:162: error: cannot find symbol

        [javac] public void onPageLoadStopped(XWalkView view, String url, LoadStatus status) {

        [javac] ^

        [javac] symbol: class XWalkView

        [javac] location: class XWalkCordovaUiClient

        [javac] /project/src/org/crosswalk/engine/XWalkCordovaUiClient.java:162: error: cannot find symbol

        [javac] public void onPageLoadStopped(XWalkView view, String url, LoadStatus status) {

        [javac] ^

        [javac] symbol: class LoadStatus

        [javac] location: class XWalkCordovaUiClient

        [javac] /project/src/org/crosswalk/engine/XWalkCordovaUiClient.java:174: error: cannot find symbol

        [javac] public void openFileChooser(XWalkView view, final ValueCallback<Uri> uploadFile, String acceptType, String capture) {

        [javac] ^

        [javac] symbol: class XWalkView

        [javac] location: class XWalkCordovaUiClient

        [javac] /project/src/org/crosswalk/engine/XWalkExposedJsApi.java:26: error: package org.xwalk.core does not exist

        [javac] import org.xwalk.core.JavascriptInterface;

        [javac] ^

        [javac] /project/src/org/crosswalk/engine/XWalkExposedJsApi.java:35: error: cannot find symbol

        [javac] @JavascriptInterface

        [javac] ^

        [javac] symbol: class JavascriptInterface

        [javac] location: class XWalkExposedJsApi

        [javac] /project/src/org/crosswalk/engine/XWalkExposedJsApi.java:43: error: cannot find symbol

        [javac] @JavascriptInterface

        [javac] ^

        [javac] symbol: class JavascriptInterface

        [javac] location: class XWalkExposedJsApi

        [javac] /project/src/org/crosswalk/engine/XWalkExposedJsApi.java:48: error: cannot find symbol

        [javac] @JavascriptInterface

        [javac] ^

        [javac] symbol: class JavascriptInterface

        [javac] location: class XWalkExposedJsApi

        [javac] /project/src/org/crosswalk/engine/XWalkCordovaCookieManager.java:29: error: cannot find symbol

        [javac] cookieManager = new XWalkCookieManager();

        [javac] ^

        [javac] symbol: class XWalkCookieManager

        [javac] location: class XWalkCordovaCookieManager

        [javac] /project/src/org/crosswalk/engine/XWalkCordovaResourceClient.java:59: error: method does not override or implement a method from a supertype

        [javac] @Override

        [javac] ^

        [javac] /project/src/org/crosswalk/engine/XWalkCordovaResourceClient.java:67: error: method does not override or implement a method from a supertype

        [javac] @Override

        [javac] ^

        [javac] /project/src/org/crosswalk/engine/XWalkCordovaResourceClient.java:97: error: method does not override or implement a method from a supertype

        [javac] @Override

        [javac] ^

        [javac] /project/src/org/crosswalk/engine/XWalkCordovaResourceClient.java:110: error: method does not override or implement a method from a supertype

        [javac] @Override

        [javac] ^

        [javac] /project/src/org/crosswalk/engine/XWalkCordovaResourceClient.java:144: error: cannot find symbol

        [javac] super.onReceivedHttpAuthRequest(view, handler, host, realm);

        [javac] ^

        [javac] symbol: variable super

        [javac] location: class XWalkCordovaResourceClient

        [javac] /project/src/org/crosswalk/engine/XWalkCordovaResourceClient.java:131: error: method does not override or implement a method from a supertype

        [javac] @Override

        [javac] ^

        [javac] /project/src/org/crosswalk/engine/XWalkCordovaResourceClient.java:157: error: cannot find symbol

        [javac] super.onReceivedClientCertRequest(view, request);

        [javac] ^

        [javac] symbol: variable super

        [javac] location: class XWalkCordovaResourceClient

        [javac] /project/src/org/crosswalk/engine/XWalkCordovaResourceClient.java:147: error: method does not override or implement a method from a supertype

        [javac] @Override

        [javac] ^

        [javac] /project/src/org/crosswalk/engine/XWalkWebViewEngine.java:98: error: cannot find symbol

        [javac] XWalkWebViewEngine.this.webView.onNewIntent(intent);

        [javac] ^

        [javac] symbol: method onNewIntent(Intent)

        [javac] location: variable webView of type XWalkCordovaView

        [javac] /project/src/org/crosswalk/engine/XWalkWebViewEngine.java:108: error: cannot find symbol

        [javac] new XWalkGetBitmapCallback() {

        [javac] ^

        [javac] symbol: class XWalkGetBitmapCallback

        [javac] /project/src/org/crosswalk/engine/XWalkWebViewEngine.java:130: error: cannot find symbol

        [javac] webView.load(startUrl, null);

        [javac] ^

        [javac] symbol: method load(String,<null>)

        [javac] location: variable webView of type XWalkCordovaView

        [javac] /project/src/org/crosswalk/engine/XWalkWebViewEngine.java:134: error: cannot find symbol

        [javac] activityDelegate = new XWalkActivityDelegate((Activity) context, cancelCommand, completeCommand);

        [javac] ^

        [javac] symbol: class XWalkActivityDelegate

        [javac] location: class XWalkWebViewEngine

        [javac] /project/src/org/crosswalk/engine/XWalkWebViewEngine.java:169: error: cannot find symbol

        [javac] webView.setNetworkAvailable(value);

        [javac] ^

        [javac] symbol: method setNetworkAvailable(boolean)

        [javac] location: variable webView of type XWalkCordovaView

        [javac] /project/src/org/crosswalk/engine/XWalkWebViewEngine.java:186: error: incompatible types

        [javac] return webView;

        [javac] ^

        [javac] required: View

        [javac] found: XWalkCordovaView

        [javac] /project/src/org/crosswalk/engine/XWalkWebViewEngine.java:190: error: cannot find symbol

        [javac] webView.setVerticalScrollBarEnabled(false);

        [javac] ^

        [javac] symbol: method setVerticalScrollBarEnabled(boolean)

        [javac] location: variable webView of type XWalkCordovaView

        [javac] /project/src/org/crosswalk/engine/XWalkWebViewEngine.java:193: error: cannot find symbol

        [javac] webView.setZOrderOnTop(zOrderOnTop);

        [javac] ^

        [javac] symbol: method setZOrderOnTop(boolean)

        [javac] location: variable webView of type XWalkCordovaView

        [javac] /project/src/org/crosswalk/engine/XWalkWebViewEngine.java:198: error: cannot find symbol

        [javac] webView.setUserAgentString(xwalkUserAgent);

        [javac] ^

        [javac] symbol: method setUserAgentString(String)

        [javac] location: variable webView of type XWalkCordovaView

        [javac] /project/src/org/crosswalk/engine/XWalkWebViewEngine.java:203: error: cannot find symbol

        [javac] webView.setUserAgentString(webView.getUserAgentString() + " " + appendUserAgent);

        [javac] ^

        [javac] symbol: method getUserAgentString()

        [javac] location: variable webView of type XWalkCordovaView

        [javac] /project/src/org/crosswalk/engine/XWalkWebViewEngine.java:231: error: cannot find symbol

        [javac] webView.getExtensionManager().loadExtension(XWALK_EXTENSIONS_FOLDER + File.separator + path);

        [javac] ^

        [javac] symbol: method getExtensionManager()

        [javac] location: variable webView of type XWalkCordovaView

        [javac] /project/src/org/crosswalk/engine/XWalkWebViewEngine.java:238: error: cannot find symbol

        [javac] return this.webView.getNavigationHistory().canGoBack();

        [javac] ^

        [javac] symbol: method getNavigationHistory()

        [javac] location: variable webView of type XWalkCordovaView

        [javac] /project/src/org/crosswalk/engine/XWalkWebViewEngine.java:243: error: cannot find symbol

        [javac] if (this.webView.getNavigationHistory().canGoBack()) {

        [javac] ^

        [javac] symbol: method getNavigationHistory()

        [javac] location: variable webView of type XWalkCordovaView

        [javac] /project/src/org/crosswalk/engine/XWalkWebViewEngine.java:244: error: package XWalkNavigationHistory does not exist

        [javac] this.webView.getNavigationHistory().navigate(XWalkNavigationHistory.Direction.BACKWARD, 1);

        [javac] ^

        [javac] /project/src/org/crosswalk/engine/XWalkWebViewEngine.java:244: error: cannot find symbol

        [javac] this.webView.getNavigationHistory().navigate(XWalkNavigationHistory.Direction.BACKWARD, 1);

        [javac] ^

        [javac] symbol: method getNavigationHistory()

        [javac] location: variable webView of type XWalkCordovaView

        [javac] /project/src/org/crosswalk/engine/XWalkWebViewEngine.java:257: error: cannot find symbol

        [javac] webView.resumeTimers();

        [javac] ^

        [javac] symbol: method resumeTimers()

        [javac] location: variable webView of type XWalkCordovaView

        [javac] /project/src/org/crosswalk/engine/XWalkWebViewEngine.java:264: error: cannot find symbol

        [javac] webView.onDestroy();

        [javac] ^

        [javac] symbol: method onDestroy()

        [javac] location: variable webView of type XWalkCordovaView

        [javac] /project/src/org/crosswalk/engine/XWalkWebViewEngine.java:270: error: cannot find symbol

        [javac] this.webView.getNavigationHistory().clear();

        [javac] ^

        [javac] symbol: method getNavigationHistory()

        [javac] location: variable webView of type XWalkCordovaView

        [javac] /project/src/org/crosswalk/engine/XWalkWebViewEngine.java:276: error: cannot find symbol

        [javac] this.webView.stopLoading();

        [javac] ^

        [javac] symbol: method stopLoading()

        [javac] location: variable webView of type XWalkCordovaView

        [javac] /project/src/org/crosswalk/engine/XWalkWebViewEngine.java:282: error: cannot find symbol

        [javac] webView.clearCache(true);

        [javac] ^

        [javac] symbol: method clearCache(boolean)

        [javac] location: variable webView of type XWalkCordovaView

        [javac] /project/src/org/crosswalk/engine/XWalkWebViewEngine.java:288: error: cannot find symbol

        [javac] return this.webView.getUrl();

        [javac] ^

        [javac] symbol: method getUrl()

        [javac] location: variable webView of type XWalkCordovaView

        [javac] /project/src/org/crosswalk/engine/XWalkWebViewEngine.java:302: error: cannot find symbol

        [javac] webView.load(url, null);

        [javac] ^

        [javac] symbol: method load(String,<null>)

        [javac] location: variable webView of type XWalkCordovaView

        [javac] /project/src/org/crosswalk/engine/XWalkCordovaView.java:44: error: cannot find symbol

        [javac] XWalkPreferences.setValue(XWalkPreferences.ANIMATABLE_XWALK_VIEW, prefAnimatable || manifestAnimatable);

        [javac] ^

        [javac] symbol: variable XWalkPreferences

        [javac] location: class XWalkCordovaView

        [javac] /project/src/org/crosswalk/engine/XWalkCordovaView.java:44: error: cannot find symbol

        [javac] XWalkPreferences.setValue(XWalkPreferences.ANIMATABLE_XWALK_VIEW, prefAnimatable || manifestAnimatable);

        [javac] ^

        [javac] symbol: variable XWalkPreferences

        [javac] location: class XWalkCordovaView

        [javac] /project/src/org/crosswalk/engine/XWalkCordovaView.java:46: error: cannot find symbol

        [javac] XWalkPreferences.setValue(XWalkPreferences.REMOTE_DEBUGGING, true);

        [javac] ^

        [javac] symbol: variable XWalkPreferences

        [javac] location: class XWalkCordovaView

        [javac] /project/src/org/crosswalk/engine/XWalkCordovaView.java:46: error: cannot find symbol

        [javac] XWalkPreferences.setValue(XWalkPreferences.REMOTE_DEBUGGING, true);

        [javac] ^

        [javac] symbol: variable XWalkPreferences

        [javac] location: class XWalkCordovaView

        [javac] /project/src/org/crosswalk/engine/XWalkCordovaView.java:48: error: cannot find symbol

        [javac] XWalkPreferences.setValue(XWalkPreferences.JAVASCRIPT_CAN_OPEN_WINDOW, true);

        [javac] ^

        [javac] symbol: variable XWalkPreferences

        [javac] location: class XWalkCordovaView

        [javac] /project/src/org/crosswalk/engine/XWalkCordovaView.java:48: error: cannot find symbol

        [javac] XWalkPreferences.setValue(XWalkPreferences.JAVASCRIPT_CAN_OPEN_WINDOW, true);

        [javac] ^

        [javac] symbol: variable XWalkPreferences

        [javac] location: class XWalkCordovaView

        [javac] /project/src/org/crosswalk/engine/XWalkCordovaView.java:49: error: cannot find symbol

        [javac] XWalkPreferences.setValue(XWalkPreferences.ALLOW_UNIVERSAL_ACCESS_FROM_FILE, true);

        [javac] ^

        [javac] symbol: variable XWalkPreferences

        [javac] location: class XWalkCordovaView

        [javac] /project/src/org/crosswalk/engine/XWalkCordovaView.java:49: error: cannot find symbol

        [javac] XWalkPreferences.setValue(XWalkPreferences.ALLOW_UNIVERSAL_ACCESS_FROM_FILE, true);

        [javac] ^

        [javac] symbol: variable XWalkPreferences

        [javac] location: class XWalkCordovaView

        [javac] /project/src/org/crosswalk/engine/XWalkCordovaView.java:64: error: bad operand types for binary operator '=='

        [javac] if (resourceClient == null) {

        [javac] ^

        [javac] first type: XWalkCordovaResourceClient

        [javac] second type: <null>

        [javac] /project/src/org/crosswalk/engine/XWalkCordovaView.java:67: error: bad operand types for binary operator '=='

        [javac] if (uiClient == null) {

        [javac] ^

        [javac] first type: XWalkCordovaUiClient

        [javac] second type: <null>

        [javac] /project/src/org/crosswalk/engine/XWalkCordovaView.java:78: error: cannot find symbol

        [javac] super.setResourceClient(client);

        [javac] ^

        [javac] symbol: variable super

        [javac] location: class XWalkCordovaView

        [javac] /project/src/org/crosswalk/engine/XWalkCordovaView.java:72: error: method does not override or implement a method from a supertype

        [javac] @Override

        [javac] ^

        [javac] /project/src/org/crosswalk/engine/XWalkCordovaView.java:87: error: cannot find symbol

        [javac] super.setUIClient(client);

        [javac] ^

        [javac] symbol: variable super

        [javac] location: class XWalkCordovaView

        [javac] /project/src/org/crosswalk/engine/XWalkCordovaView.java:81: error: method does not override or implement a method from a supertype

        [javac] @Override

        [javac] ^

        [javac] 100 errors

       

      BUILD FAILED

      /android-sdk/tools/ant/build.xml:716: The following error occurred while executing this line:

      /android-sdk/tools/ant/build.xml:730: Compile failed; see the compiler error output for details.

       

      Total time: 5 seconds

       

      /project/cordova/node_modules/q/q.js:126

        throw e;

        ^

      Error code 1 for command: ant with args: debug,-f,/project/build.xml

       

      Build Date: 2016-07-20 14:19:30 +0000 -------------------------------------------------------------------------------- PLUGIN OUTPUT -------------------------------------------------------------------------------- Fetching plugin "cordova-plugin-crosswalk-webview" via npm Installing "cordova-plugin-crosswalk-webview" at "1.8.0" for android Fetching plugin "cordova-plugin-whitelist" via npm Installing "cordova-plugin-whitelist" at "1.2.2" for android                 This plugin is only applicable for versions of cordova-android greater than 4.0. If you have a previous platform version, you do *not* need this plugin since the whitelist will be built in. -------------------------------------------------------------------------------- COMPILE OUTPUT -------------------------------------------------------------------------------- Executing: ant debug -f /project/build.xml Buildfile: /project/build.xml Buildfile: /project/build.xml  -check-env:  [checkenv] Android SDK Tools Revision 25.1.7  -setup:      [echo] Project Name: .AsteroidsAhead   [gettype] Project Type: Application  -pre-clean:  clean: [getlibpath] Library dependencies: [getlibpath]  [getlibpath] ------------------ [getlibpath] Ordered libraries:  -set-mode-check:  -set-debug-files:  -check-env:  [checkenv] Android SDK Tools Revision 25.1.7  -setup:      [echo] Project Name: .AsteroidsAhead   [gettype] Project Type: Application  -set-debug-mode:  -debug-obfuscation-check:  -pre-build:  -build-setup:  nodeps:  -check-env:  [checkenv] Android SDK Tools Revision 25.1.7  -setup:      [echo] Project Name: .AsteroidsAhead   [gettype] Project Type: Android Library [getbuildtools] Using latest Build Tools: 23.0.1  -pre-clean:  clean:      [echo] Resolving Build Target for .AsteroidsAhead...  BUILD SUCCESSFUL Total time: 1 second [gettarget] Project Target:   Android 5.1.1 [gettarget] API level:        22      [echo] ----------      [echo] Creating output directories if needed...     [mkdir] Created dir: /project/bin     [mkdir] Created dir: /project/bin/res     [mkdir] Created dir: /project/bin/rsObj     [mkdir] Created dir: /project/bin/rsLibs     [mkdir] Created dir: /project/gen     [mkdir] Created dir: /project/bin/classes     [mkdir] Created dir: /project/bin/dexedLibs      [echo] ----------      [echo] Resolving Dependencies for .AsteroidsAhead... [dependency] Library dependencies: [dependency]  [dependency] ------------------ [dependency] Ordered libraries: [dependency]  [dependency] ------------------      [echo] ----------      [echo] Building Libraries with 'debug'...  nodeps:  -set-mode-check:  -set-debug-files:  -check-env:  [checkenv] Android SDK Tools Revision 25.1.7  -setup:      [echo] Project Name: .AsteroidsAhead   [gettype] Project Type: Android Library  -set-debug-mode:  -debug-obfuscation-check:  -pre-build:  -build-setup: [getbuildtools] Using latest Build Tools: 23.0.1      [echo] Resolving Build Target for .AsteroidsAhead... [gettarget] Project Target:   Android 5.1.1 [gettarget] API level:        22      [echo] ----------      [echo] Creating output directories if needed...     [mkdir] Created dir: /project/CordovaLib/res     [mkdir] Created dir: /project/CordovaLib/libs     [mkdir] Created dir: /project/CordovaLib/bin     [mkdir] Created dir: /project/CordovaLib/bin/res     [mkdir] Created dir: /project/CordovaLib/bin/rsObj     [mkdir] Created dir: /project/CordovaLib/bin/rsLibs     [mkdir] Created dir: /project/CordovaLib/gen     [mkdir] Created dir: /project/CordovaLib/bin/classes     [mkdir] Created dir: /project/CordovaLib/bin/dexedLibs      [echo] ----------      [echo] Resolving Dependencies for .AsteroidsAhead... [dependency] Library dependencies: [dependency] No Libraries [dependency]  [dependency] ------------------  -code-gen: [mergemanifest] Merging AndroidManifest files into one. [mergemanifest] Manifest merger disabled. Using project manifest only.      [echo] Handling aidl files...      [aidl] No AIDL files to compile.      [echo] ----------      [echo] Handling RenderScript files...      [echo] ----------      [echo] Handling Resources...      [aapt] Generating resource IDs...      [echo] ----------      [echo] Handling BuildConfig class... [buildconfig] Generating BuildConfig class.  -pre-compile:  -compile:     [javac] Compiling 36 source files to /project/CordovaLib/bin/classes     [javac] Note: Some input files use or override a deprecated API.     [javac] Note: Recompile with -Xlint:deprecation for details.      [echo] Creating library output jar file...       [jar] Building jar: /project/CordovaLib/bin/classes.jar  -post-compile:  -obfuscate:  -dex:      [echo] Library project: do not convert bytecode...  -crunch:    [crunch] Crunching PNG Files in source dir: /project/CordovaLib/res    [crunch] To destination dir: /project/CordovaLib/bin/res    [crunch] Crunched 0 PNG files to update cache  -package-resources:      [echo] Library project: do not package resources...  -package:      [echo] Library project: do not package apk...  -post-package:  -do-debug:      [echo] Library project: do not create apk... [propertyfile] Creating new property file: /project/CordovaLib/bin/build.prop [propertyfile] Updating property file: /project/CordovaLib/bin/build.prop [propertyfile] Updating property file: /project/CordovaLib/bin/build.prop [propertyfile] Updating property file: /project/CordovaLib/bin/build.prop  -post-build:  debug:  -code-gen: [mergemanifest] Merging AndroidManifest files into one. [mergemanifest] Manifest merger disabled. Using project manifest only.      [echo] Handling aidl files...      [aidl] No AIDL files to compile.      [echo] ----------      [echo] Handling RenderScript files...      [echo] ----------      [echo] Handling Resources...      [aapt] Generating resource IDs...      [echo] ----------      [echo] Handling BuildConfig class... [buildconfig] Generating BuildConfig class.  -pre-compile:  -compile:     [javac] Compiling 12 source files to /project/bin/classes     [javac] /project/src/org/crosswalk/engine/XWalkCordovaClientCertRequest.java:22: error: package org.xwalk.core does not exist     [javac] import org.xwalk.core.ClientCertRequest;     [javac]                      ^     [javac] /project/src/org/crosswalk/engine/XWalkCordovaClientCertRequest.java:31: error: cannot find symbol     [javac]     private final ClientCertRequest request;     [javac]                   ^     [javac]   symbol:   class ClientCertRequest     [javac]   location: class XWalkCordovaClientCertRequest     [javac] /project/src/org/crosswalk/engine/XWalkCordovaClientCertRequest.java:33: error: cannot find symbol     [javac]     public XWalkCordovaClientCertRequest(ClientCertRequest request) {     [javac]                                          ^     [javac]   symbol:   class ClientCertRequest     [javac]   location: class XWalkCordovaClientCertRequest     [javac] /project/src/org/crosswalk/engine/XWalkCordovaCookieManager.java:22: error: package org.xwalk.core does not exist     [javac] import org.xwalk.core.XWalkCookieManager;     [javac]                      ^     [javac] /project/src/org/crosswalk/engine/XWalkCordovaCookieManager.java:26: error: cannot find symbol     [javac]     protected XWalkCookieManager cookieManager = null;     [javac]               ^     [javac]   symbol:   class XWalkCookieManager     [javac]   location: class XWalkCordovaCookieManager     [javac] /project/src/org/crosswalk/engine/XWalkCordovaHttpAuthHandler.java:22: error: package org.xwalk.core does not exist     [javac] import org.xwalk.core.XWalkHttpAuthHandler;     [javac]                      ^     [javac] /project/src/org/crosswalk/engine/XWalkCordovaHttpAuthHandler.java:30: error: cannot find symbol     [javac]     private final XWalkHttpAuthHandler handler;     [javac]                   ^     [javac]   symbol:   class XWalkHttpAuthHandler     [javac]   location: class XWalkCordovaHttpAuthHandler     [javac] /project/src/org/crosswalk/engine/XWalkCordovaHttpAuthHandler.java:32: error: cannot find symbol     [javac]     public XWalkCordovaHttpAuthHandler(XWalkHttpAuthHandler handler) {     [javac]                                        ^     [javac]   symbol:   class XWalkHttpAuthHandler     [javac]   location: class XWalkCordovaHttpAuthHandler     [javac] /project/src/org/crosswalk/engine/XWalkCordovaResourceClient.java:32: error: package org.xwalk.core does not exist     [javac] import org.xwalk.core.ClientCertRequest;     [javac]                      ^     [javac] /project/src/org/crosswalk/engine/XWalkCordovaResourceClient.java:33: error: package org.xwalk.core does not exist     [javac] import org.xwalk.core.XWalkHttpAuthHandler;     [javac]                      ^     [javac] /project/src/org/crosswalk/engine/XWalkCordovaResourceClient.java:34: error: package org.xwalk.core does not exist     [javac] import org.xwalk.core.XWalkResourceClient;     [javac]                      ^     [javac] /project/src/org/crosswalk/engine/XWalkCordovaResourceClient.java:35: error: package org.xwalk.core does not exist     [javac] import org.xwalk.core.XWalkView;     [javac]                      ^     [javac] /project/src/org/crosswalk/engine/XWalkCordovaResourceClient.java:40: error: cannot find symbol     [javac] public class XWalkCordovaResourceClient extends XWalkResourceClient {     [javac]                                                 ^     [javac]   symbol: class XWalkResourceClient     [javac] /project/src/org/crosswalk/engine/XWalkWebViewEngine.java:47: error: package org.xwalk.core does not exist     [javac] import org.xwalk.core.XWalkActivityDelegate;     [javac]                      ^     [javac] /project/src/org/crosswalk/engine/XWalkWebViewEngine.java:48: error: package org.xwalk.core does not exist     [javac] import org.xwalk.core.XWalkNavigationHistory;     [javac]                      ^     [javac] /project/src/org/crosswalk/engine/XWalkWebViewEngine.java:49: error: package org.xwalk.core does not exist     [javac] import org.xwalk.core.XWalkView;     [javac]                      ^     [javac] /project/src/org/crosswalk/engine/XWalkWebViewEngine.java:50: error: package org.xwalk.core does not exist     [javac] import org.xwalk.core.XWalkGetBitmapCallback;     [javac]                      ^     [javac] /project/src/org/crosswalk/engine/XWalkCordovaResourceClient.java:60: error: cannot find symbol     [javac]     public void onReceivedLoadError(XWalkView view, int errorCode, String description,     [javac]                                     ^     [javac]   symbol:   class XWalkView     [javac]   location: class XWalkCordovaResourceClient     [javac] /project/src/org/crosswalk/engine/XWalkCordovaResourceClient.java:68: error: cannot find symbol     [javac]     public WebResourceResponse shouldInterceptLoadRequest(XWalkView view, String url) {     [javac]                                                           ^     [javac]   symbol:   class XWalkView     [javac]   location: class XWalkCordovaResourceClient     [javac] /project/src/org/crosswalk/engine/XWalkCordovaResourceClient.java:98: error: cannot find symbol     [javac]     public boolean shouldOverrideUrlLoading(XWalkView view, String url) {     [javac]                                             ^     [javac]   symbol:   class XWalkView     [javac]   location: class XWalkCordovaResourceClient     [javac] /project/src/org/crosswalk/engine/XWalkCordovaResourceClient.java:111: error: cannot find symbol     [javac]     public void onReceivedSslError(XWalkView view, ValueCallback<Boolean> callback, SslError error) {     [javac]                                    ^     [javac]   symbol:   class XWalkView     [javac]   location: class XWalkCordovaResourceClient     [javac] /project/src/org/crosswalk/engine/XWalkCordovaResourceClient.java:132: error: cannot find symbol     [javac]     public void onReceivedHttpAuthRequest(XWalkView view, XWalkHttpAuthHandler handler,     [javac]                                           ^     [javac]   symbol:   class XWalkView     [javac]   location: class XWalkCordovaResourceClient     [javac] /project/src/org/crosswalk/engine/XWalkCordovaResourceClient.java:132: error: cannot find symbol     [javac]     public void onReceivedHttpAuthRequest(XWalkView view, XWalkHttpAuthHandler handler,     [javac]                                                           ^     [javac]   symbol:   class XWalkHttpAuthHandler     [javac]   location: class XWalkCordovaResourceClient     [javac] /project/src/org/crosswalk/engine/XWalkCordovaResourceClient.java:148: error: cannot find symbol     [javac]     public void onReceivedClientCertRequest(XWalkView view, ClientCertRequest request) {     [javac]                                             ^     [javac]   symbol:   class XWalkView     [javac]   location: class XWalkCordovaResourceClient     [javac] /project/src/org/crosswalk/engine/XWalkCordovaResourceClient.java:148: error: cannot find symbol     [javac]     public void onReceivedClientCertRequest(XWalkView view, ClientCertRequest request) {     [javac]                                                             ^     [javac]   symbol:   class ClientCertRequest     [javac]   location: class XWalkCordovaResourceClient     [javac] /project/src/org/crosswalk/engine/XWalkCordovaView.java:4: error: package org.xwalk.core does not exist     [javac] import org.xwalk.core.XWalkPreferences;     [javac]                      ^     [javac] /project/src/org/crosswalk/engine/XWalkCordovaView.java:5: error: package org.xwalk.core does not exist     [javac] import org.xwalk.core.XWalkResourceClient;     [javac]                      ^     [javac] /project/src/org/crosswalk/engine/XWalkCordovaView.java:6: error: package org.xwalk.core does not exist     [javac] import org.xwalk.core.XWalkUIClient;     [javac]                      ^     [javac] /project/src/org/crosswalk/engine/XWalkCordovaView.java:7: error: package org.xwalk.core does not exist     [javac] import org.xwalk.core.XWalkView;     [javac]                      ^     [javac] /project/src/org/crosswalk/engine/XWalkCordovaView.java:22: error: cannot find symbol     [javac] public class XWalkCordovaView extends XWalkView implements CordovaWebViewEngine.EngineView {     [javac]                                       ^     [javac]   symbol: class XWalkView     [javac] /project/src/org/crosswalk/engine/XWalkWebViewEngine.java:72: error: cannot find symbol     [javac]     protected XWalkActivityDelegate activityDelegate;     [javac]               ^     [javac]   symbol:   class XWalkActivityDelegate     [javac]   location: class XWalkWebViewEngine     [javac] /project/src/org/crosswalk/engine/XWalkWebViewEngine.java:212: error: cannot find symbol     [javac]     private static void exposeJsInterface(XWalkView webView, CordovaBridge bridge) {     [javac]                                           ^     [javac]   symbol:   class XWalkView     [javac]   location: class XWalkWebViewEngine     [javac] /project/src/org/crosswalk/engine/XWalkCordovaUiClient.java:31: error: package org.xwalk.core does not exist     [javac] import org.xwalk.core.XWalkJavascriptResult;     [javac]                      ^     [javac] /project/src/org/crosswalk/engine/XWalkCordovaUiClient.java:32: error: package org.xwalk.core does not exist     [javac] import org.xwalk.core.XWalkUIClient;     [javac]                      ^     [javac] /project/src/org/crosswalk/engine/XWalkCordovaUiClient.java:33: error: package org.xwalk.core does not exist     [javac] import org.xwalk.core.XWalkView;     [javac]                      ^     [javac] /project/src/org/crosswalk/engine/XWalkCordovaUiClient.java:35: error: cannot find symbol     [javac] public class XWalkCordovaUiClient extends XWalkUIClient {     [javac]                                           ^     [javac]   symbol: class XWalkUIClient     [javac] /project/src/org/crosswalk/engine/XWalkCordovaView.java:73: error: cannot find symbol     [javac]     public void setResourceClient(XWalkResourceClient client) {     [javac]                                   ^     [javac]   symbol:   class XWalkResourceClient     [javac]   location: class XWalkCordovaView     [javac] /project/src/org/crosswalk/engine/XWalkCordovaView.java:82: error: cannot find symbol     [javac]     public void setUIClient(XWalkUIClient client) {     [javac]                             ^     [javac]   symbol:   class XWalkUIClient     [javac]   location: class XWalkCordovaView     [javac] /project/src/org/crosswalk/engine/XWalkCordovaUiClient.java:49: error: cannot find symbol     [javac]     public boolean onJavascriptModalDialog(XWalkView view, JavascriptMessageType type, String url,     [javac]                                            ^     [javac]   symbol:   class XWalkView     [javac]   location: class XWalkCordovaUiClient     [javac] /project/src/org/crosswalk/engine/XWalkCordovaUiClient.java:49: error: cannot find symbol     [javac]     public boolean onJavascriptModalDialog(XWalkView view, JavascriptMessageType type, String url,     [javac]                                                            ^     [javac]   symbol:   class JavascriptMessageType     [javac]   location: class XWalkCordovaUiClient     [javac] /project/src/org/crosswalk/engine/XWalkCordovaUiClient.java:50: error: cannot find symbol     [javac]                                            String message, String defaultValue, XWalkJavascriptResult result) {     [javac]                                                                                 ^     [javac]   symbol:   class XWalkJavascriptResult     [javac]   location: class XWalkCordovaUiClient     [javac] /project/src/org/crosswalk/engine/XWalkCordovaUiClient.java:71: error: cannot find symbol     [javac]     public boolean onJsAlert(XWalkView view, String url, String message,     [javac]                              ^     [javac]   symbol:   class XWalkView     [javac]   location: class XWalkCordovaUiClient     [javac] /project/src/org/crosswalk/engine/XWalkCordovaUiClient.java:72: error: cannot find symbol     [javac]                               final XWalkJavascriptResult result) {     [javac]                                     ^     [javac]   symbol:   class XWalkJavascriptResult     [javac]   location: class XWalkCordovaUiClient     [javac] /project/src/org/crosswalk/engine/XWalkCordovaUiClient.java:89: error: cannot find symbol     [javac]     public boolean onJsConfirm(XWalkView view, String url, String message,     [javac]                                ^     [javac]   symbol:   class XWalkView     [javac]   location: class XWalkCordovaUiClient     [javac] /project/src/org/crosswalk/engine/XWalkCordovaUiClient.java:90: error: cannot find symbol     [javac]                                 final XWalkJavascriptResult result) {     [javac]                                       ^     [javac]   symbol:   class XWalkJavascriptResult     [javac]   location: class XWalkCordovaUiClient     [javac] /project/src/org/crosswalk/engine/XWalkCordovaUiClient.java:112: error: cannot find symbol     [javac]     public boolean onJsPrompt(XWalkView view, String origin, String message, String defaultValue,     [javac]                               ^     [javac]   symbol:   class XWalkView     [javac]   location: class XWalkCordovaUiClient     [javac] /project/src/org/crosswalk/engine/XWalkCordovaUiClient.java:113: error: cannot find symbol     [javac]                                final XWalkJavascriptResult result) {     [javac]                                      ^     [javac]   symbol:   class XWalkJavascriptResult     [javac]   location: class XWalkCordovaUiClient     [javac] /project/src/org/crosswalk/engine/XWalkCordovaUiClient.java:144: error: cannot find symbol     [javac]     public void onPageLoadStarted(XWalkView view, String url) {     [javac]                                   ^     [javac]   symbol:   class XWalkView     [javac]   location: class XWalkCordovaUiClient     [javac] /project/src/org/crosswalk/engine/XWalkCordovaUiClient.java:162: error: cannot find symbol     [javac]     public void onPageLoadStopped(XWalkView view, String url, LoadStatus status) {     [javac]                                   ^     [javac]   symbol:   class XWalkView     [javac]   location: class XWalkCordovaUiClient     [javac] /project/src/org/crosswalk/engine/XWalkCordovaUiClient.java:162: error: cannot find symbol     [javac]     public void onPageLoadStopped(XWalkView view, String url, LoadStatus status) {     [javac]                                                               ^     [javac]   symbol:   class LoadStatus     [javac]   location: class XWalkCordovaUiClient     [javac] /project/src/org/crosswalk/engine/XWalkCordovaUiClient.java:174: error: cannot find symbol     [javac]     public void openFileChooser(XWalkView view, final ValueCallback<Uri> uploadFile, String acceptType, String capture) {     [javac]                                 ^     [javac]   symbol:   class XWalkView     [javac]   location: class XWalkCordovaUiClient     [javac] /project/src/org/crosswalk/engine/XWalkExposedJsApi.java:26: error: package org.xwalk.core does not exist     [javac] import org.xwalk.core.JavascriptInterface;     [javac]                      ^     [javac] /project/src/org/crosswalk/engine/XWalkExposedJsApi.java:35: error: cannot find symbol     [javac]     @JavascriptInterface     [javac]      ^     [javac]   symbol:   class JavascriptInterface     [javac]   location: class XWalkExposedJsApi     [javac] /project/src/org/crosswalk/engine/XWalkExposedJsApi.java:43: error: cannot find symbol     [javac]     @JavascriptInterface     [javac]      ^     [javac]   symbol:   class JavascriptInterface     [javac]   location: class XWalkExposedJsApi     [javac] /project/src/org/crosswalk/engine/XWalkExposedJsApi.java:48: error: cannot find symbol     [javac]     @JavascriptInterface     [javac]      ^     [javac]   symbol:   class JavascriptInterface     [javac]   location: class XWalkExposedJsApi     [javac] /project/src/org/crosswalk/engine/XWalkCordovaCookieManager.java:29: error: cannot find symbol     [javac]         cookieManager = new XWalkCookieManager();     [javac]                             ^     [javac]   symbol:   class XWalkCookieManager     [javac]   location: class XWalkCordovaCookieManager     [javac] /project/src/org/crosswalk/engine/XWalkCordovaResourceClient.java:59: error: method does not override or implement a method from a supertype     [javac]     @Override     [javac]     ^     [javac] /project/src/org/crosswalk/engine/XWalkCordovaResourceClient.java:67: error: method does not override or implement a method from a supertype     [javac]     @Override     [javac]     ^     [javac] /project/src/org/crosswalk/engine/XWalkCordovaResourceClient.java:97: error: method does not override or implement a method from a supertype     [javac]     @Override     [javac]     ^     [javac] /project/src/org/crosswalk/engine/XWalkCordovaResourceClient.java:110: error: method does not override or implement a method from a supertype     [javac]     @Override     [javac]     ^     [javac] /project/src/org/crosswalk/engine/XWalkCordovaResourceClient.java:144: error: cannot find symbol     [javac]         super.onReceivedHttpAuthRequest(view, handler, host, realm);     [javac]         ^     [javac]   symbol:   variable super     [javac]   location: class XWalkCordovaResourceClient     [javac] /project/src/org/crosswalk/engine/XWalkCordovaResourceClient.java:131: error: method does not override or implement a method from a supertype     [javac]     @Override     [javac]     ^     [javac] /project/src/org/crosswalk/engine/XWalkCordovaResourceClient.java:157: error: cannot find symbol     [javac]         super.onReceivedClientCertRequest(view, request);     [javac]         ^     [javac]   symbol:   variable super     [javac]   location: class XWalkCordovaResourceClient     [javac] /project/src/org/crosswalk/engine/XWalkCordovaResourceClient.java:147: error: method does not override or implement a method from a supertype     [javac]     @Override     [javac]     ^     [javac] /project/src/org/crosswalk/engine/XWalkWebViewEngine.java:98: error: cannot find symbol     [javac]                         XWalkWebViewEngine.this.webView.onNewIntent(intent);     [javac]                                                        ^     [javac]   symbol:   method onNewIntent(Intent)     [javac]   location: variable webView of type XWalkCordovaView     [javac] /project/src/org/crosswalk/engine/XWalkWebViewEngine.java:108: error: cannot find symbol     [javac]                                             new XWalkGetBitmapCallback() {     [javac]                                                 ^     [javac]   symbol: class XWalkGetBitmapCallback     [javac] /project/src/org/crosswalk/engine/XWalkWebViewEngine.java:130: error: cannot find symbol     [javac]                     webView.load(startUrl, null);     [javac]                            ^     [javac]   symbol:   method load(String,<null>)     [javac]   location: variable webView of type XWalkCordovaView     [javac] /project/src/org/crosswalk/engine/XWalkWebViewEngine.java:134: error: cannot find symbol     [javac]         activityDelegate = new XWalkActivityDelegate((Activity) context, cancelCommand, completeCommand);     [javac]                                ^     [javac]   symbol:   class XWalkActivityDelegate     [javac]   location: class XWalkWebViewEngine     [javac] /project/src/org/crosswalk/engine/XWalkWebViewEngine.java:169: error: cannot find symbol     [javac]                 webView.setNetworkAvailable(value);     [javac]                        ^     [javac]   symbol:   method setNetworkAvailable(boolean)     [javac]   location: variable webView of type XWalkCordovaView     [javac] /project/src/org/crosswalk/engine/XWalkWebViewEngine.java:186: error: incompatible types     [javac]         return webView;     [javac]                ^     [javac]   required: View     [javac]   found:    XWalkCordovaView     [javac] /project/src/org/crosswalk/engine/XWalkWebViewEngine.java:190: error: cannot find symbol     [javac]         webView.setVerticalScrollBarEnabled(false);     [javac]                ^     [javac]   symbol:   method setVerticalScrollBarEnabled(boolean)     [javac]   location: variable webView of type XWalkCordovaView     [javac] /project/src/org/crosswalk/engine/XWalkWebViewEngine.java:193: error: cannot find symbol     [javac]         webView.setZOrderOnTop(zOrderOnTop);     [javac]                ^     [javac]   symbol:   method setZOrderOnTop(boolean)     [javac]   location: variable webView of type XWalkCordovaView     [javac] /project/src/org/crosswalk/engine/XWalkWebViewEngine.java:198: error: cannot find symbol     [javac]             webView.setUserAgentString(xwalkUserAgent);     [javac]                    ^     [javac]   symbol:   method setUserAgentString(String)     [javac]   location: variable webView of type XWalkCordovaView     [javac] /project/src/org/crosswalk/engine/XWalkWebViewEngine.java:203: error: cannot find symbol     [javac]             webView.setUserAgentString(webView.getUserAgentString() + " " + appendUserAgent);     [javac]                                               ^     [javac]   symbol:   method getUserAgentString()     [javac]   location: variable webView of type XWalkCordovaView     [javac] /project/src/org/crosswalk/engine/XWalkWebViewEngine.java:231: error: cannot find symbol     [javac]             webView.getExtensionManager().loadExtension(XWALK_EXTENSIONS_FOLDER + File.separator + path);     [javac]                    ^     [javac]   symbol:   method getExtensionManager()     [javac]   location: variable webView of type XWalkCordovaView     [javac] /project/src/org/crosswalk/engine/XWalkWebViewEngine.java:238: error: cannot find symbol     [javac]         return this.webView.getNavigationHistory().canGoBack();     [javac]                            ^     [javac]   symbol:   method getNavigationHistory()     [javac]   location: variable webView of type XWalkCordovaView     [javac] /project/src/org/crosswalk/engine/XWalkWebViewEngine.java:243: error: cannot find symbol     [javac]         if (this.webView.getNavigationHistory().canGoBack()) {     [javac]                         ^     [javac]   symbol:   method getNavigationHistory()     [javac]   location: variable webView of type XWalkCordovaView     [javac] /project/src/org/crosswalk/engine/XWalkWebViewEngine.java:244: error: package XWalkNavigationHistory does not exist     [javac]             this.webView.getNavigationHistory().navigate(XWalkNavigationHistory.Direction.BACKWARD, 1);     [javac]                                                                                ^     [javac] /project/src/org/crosswalk/engine/XWalkWebViewEngine.java:244: error: cannot find symbol     [javac]             this.webView.getNavigationHistory().navigate(XWalkNavigationHistory.Direction.BACKWARD, 1);     [javac]                         ^     [javac]   symbol:   method getNavigationHistory()     [javac]   location: variable webView of type XWalkCordovaView     [javac] /project/src/org/crosswalk/engine/XWalkWebViewEngine.java:257: error: cannot find symbol     [javac]             webView.resumeTimers();     [javac]                    ^     [javac]   symbol:   method resumeTimers()     [javac]   location: variable webView of type XWalkCordovaView     [javac] /project/src/org/crosswalk/engine/XWalkWebViewEngine.java:264: error: cannot find symbol     [javac]         webView.onDestroy();     [javac]                ^     [javac]   symbol:   method onDestroy()     [javac]   location: variable webView of type XWalkCordovaView     [javac] /project/src/org/crosswalk/engine/XWalkWebViewEngine.java:270: error: cannot find symbol     [javac]         this.webView.getNavigationHistory().clear();     [javac]                     ^     [javac]   symbol:   method getNavigationHistory()     [javac]   location: variable webView of type XWalkCordovaView     [javac] /project/src/org/crosswalk/engine/XWalkWebViewEngine.java:276: error: cannot find symbol     [javac]         this.webView.stopLoading();     [javac]                     ^     [javac]   symbol:   method stopLoading()     [javac]   location: variable webView of type XWalkCordovaView     [javac] /project/src/org/crosswalk/engine/XWalkWebViewEngine.java:282: error: cannot find symbol     [javac]         webView.clearCache(true);     [javac]                ^     [javac]   symbol:   method clearCache(boolean)     [javac]   location: variable webView of type XWalkCordovaView     [javac] /project/src/org/crosswalk/engine/XWalkWebViewEngine.java:288: error: cannot find symbol     [javac]         return this.webView.getUrl();     [javac]                            ^     [javac]   symbol:   method getUrl()     [javac]   location: variable webView of type XWalkCordovaView     [javac] /project/src/org/crosswalk/engine/XWalkWebViewEngine.java:302: error: cannot find symbol     [javac]         webView.load(url, null);     [javac]                ^     [javac]   symbol:   method load(String,<null>)     [javac]   location: variable webView of type XWalkCordovaView     [javac] /project/src/org/crosswalk/engine/XWalkCordovaView.java:44: error: cannot find symbol     [javac]             XWalkPreferences.setValue(XWalkPreferences.ANIMATABLE_XWALK_VIEW, prefAnimatable || manifestAnimatable);     [javac]                                       ^     [javac]   symbol:   variable XWalkPreferences     [javac]   location: class XWalkCordovaView     [javac] /project/src/org/crosswalk/engine/XWalkCordovaView.java:44: error: cannot find symbol     [javac]             XWalkPreferences.setValue(XWalkPreferences.ANIMATABLE_XWALK_VIEW, prefAnimatable || manifestAnimatable);     [javac]             ^     [javac]   symbol:   variable XWalkPreferences     [javac]   location: class XWalkCordovaView     [javac] /project/src/org/crosswalk/engine/XWalkCordovaView.java:46: error: cannot find symbol     [javac]                 XWalkPreferences.setValue(XWalkPreferences.REMOTE_DEBUGGING, true);     [javac]                                           ^     [javac]   symbol:   variable XWalkPreferences     [javac]   location: class XWalkCordovaView     [javac] /project/src/org/crosswalk/engine/XWalkCordovaView.java:46: error: cannot find symbol     [javac]                 XWalkPreferences.setValue(XWalkPreferences.REMOTE_DEBUGGING, true);     [javac]                 ^     [javac]   symbol:   variable XWalkPreferences     [javac]   location: class XWalkCordovaView     [javac] /project/src/org/crosswalk/engine/XWalkCordovaView.java:48: error: cannot find symbol     [javac]             XWalkPreferences.setValue(XWalkPreferences.JAVASCRIPT_CAN_OPEN_WINDOW, true);     [javac]                                       ^     [javac]   symbol:   variable XWalkPreferences     [javac]   location: class XWalkCordovaView     [javac] /project/src/org/crosswalk/engine/XWalkCordovaView.java:48: error: cannot find symbol     [javac]             XWalkPreferences.setValue(XWalkPreferences.JAVASCRIPT_CAN_OPEN_WINDOW, true);     [javac]             ^     [javac]   symbol:   variable XWalkPreferences     [javac]   location: class XWalkCordovaView     [javac] /project/src/org/crosswalk/engine/XWalkCordovaView.java:49: error: cannot find symbol     [javac]             XWalkPreferences.setValue(XWalkPreferences.ALLOW_UNIVERSAL_ACCESS_FROM_FILE, true);     [javac]                                       ^     [javac]   symbol:   variable XWalkPreferences     [javac]   location: class XWalkCordovaView     [javac] /project/src/org/crosswalk/engine/XWalkCordovaView.java:49: error: cannot find symbol     [javac]             XWalkPreferences.setValue(XWalkPreferences.ALLOW_UNIVERSAL_ACCESS_FROM_FILE, true);     [javac]             ^     [javac]   symbol:   variable XWalkPreferences     [javac]   location: class XWalkCordovaView     [javac] /project/src/org/crosswalk/engine/XWalkCordovaView.java:64: error: bad operand types for binary operator '=='     [javac]         if (resourceClient == null) {     [javac]                            ^     [javac]   first type:  XWalkCordovaResourceClient     [javac]   second type: <null>     [javac] /project/src/org/crosswalk/engine/XWalkCordovaView.java:67: error: bad operand types for binary operator '=='     [javac]         if (uiClient == null) {     [javac]                      ^     [javac]   first type:  XWalkCordovaUiClient     [javac]   second type: <null>     [javac] /project/src/org/crosswalk/engine/XWalkCordovaView.java:78: error: cannot find symbol     [javac]         super.setResourceClient(client);     [javac]         ^     [javac]   symbol:   variable super     [javac]   location: class XWalkCordovaView     [javac] /project/src/org/crosswalk/engine/XWalkCordovaView.java:72: error: method does not override or implement a method from a supertype     [javac]     @Override     [javac]     ^     [javac] /project/src/org/crosswalk/engine/XWalkCordovaView.java:87: error: cannot find symbol     [javac]         super.setUIClient(client);     [javac]         ^     [javac]   symbol:   variable super     [javac]   location: class XWalkCordovaView     [javac] /project/src/org/crosswalk/engine/XWalkCordovaView.java:81: error: method does not override or implement a method from a supertype     [javac]     @Override     [javac]     ^     [javac] 100 errors  BUILD FAILED /android-sdk/tools/ant/build.xml:716: The following error occurred while executing this line: /android-sdk/tools/ant/build.xml:730: Compile failed; see the compiler error output for details.  Total time: 5 seconds  /project/cordova/node_modules/q/q.js:126                     throw e;                     ^ Error code 1 for command: ant with args: debug,-f,/project/build.xml