3 Replies Latest reply on Aug 5, 2016 12:15 PM by luis gustavo alm85508415

    Oh geez? I need help :(.

    luis gustavo alm85508415

      I'm trying to build a new phonegap app. I only create de APP and try to build.

      I executed the below command in the prompt.

          

           phonegap create cde --id "com.lganet.app" --name "CDE"

       

      So I zip de CDE folder and upload to phonegap build.

       

      PhoneGap cli: 6.3.0

      Cordova: 6.3.0

      Node: 4.4.7

      Windows 7 64bits

       

      The log:

       

      Build Date: 2016-08-04 20:54:57 +0000

      --------------------------------------------------------------------------------

      PLUGIN OUTPUT

      --------------------------------------------------------------------------------

      Installing "com.millerjames01.sqlite-plugin" at "1.0.1" for android

      Installing "com.phonegap.plugins.barcodescanner" at "2.0.0" for android

      Installing "org.apache.cordova.device" at "0.2.12" for android

      Installing "org.apache.cordova.file" at "1.3.3" for android

      Installing "org.apache.cordova.globalization" at "0.3.4" for android

      Installing "org.apache.cordova.vibration" at "0.3.13" for android

      Installing "org.apache.cordova.splashscreen" at "1.0.0" for android

      Installing "org.apache.cordova.media" at "0.2.16" for android

      Notice: org.apache.cordova.file has been automatically converted to cordova-plugin-file and fetched from npm. This is due to our old plugins registry shutting down.

      cordova-plugin-file" will not install due to "/project/cordova/plugins/org.apache.cordova.file" being installed.

      Dependent plugin "org.apache.cordova.file" already installed on android.

      Installing "org.apache.cordova.inappbrowser" at "0.6.0" for android

      Installing "org.apache.cordova.dialogs" at "0.3.0" for android

      Installing "org.apache.cordova.device-motion" at "0.2.11" for android

      Installing "org.apache.cordova.battery-status" at "0.2.12" for android

      Installing "org.apache.cordova.camera" at "0.3.6" for android

      Installing "org.apache.cordova.network-information" at "0.2.15" for android

      Installing "org.apache.cordova.media-capture" at "0.3.6" for android

      Notice: org.apache.cordova.file has been automatically converted to cordova-plugin-file and fetched from npm. This is due to our old plugins registry shutting down.

      cordova-plugin-file" will not install due to "/project/cordova/plugins/org.apache.cordova.file" being installed.

      Dependent plugin "org.apache.cordova.file" already installed on android.

      Installing "org.apache.cordova.geolocation" at "0.3.12" for android

      Installing "org.apache.cordova.file-transfer" at "0.5.0" for android

      Notice: org.apache.cordova.file has been automatically converted to cordova-plugin-file and fetched from npm. This is due to our old plugins registry shutting down.

      cordova-plugin-file" will not install due to "/project/cordova/plugins/org.apache.cordova.file" being installed.

      Dependent plugin "org.apache.cordova.file" already installed on android.

      Installing "org.apache.cordova.device-orientation" at "0.3.11" for android

      Installing "org.apache.cordova.contacts" at "0.2.16" for android

      --------------------------------------------------------------------------------

      COMPILE OUTPUT

      --------------------------------------------------------------------------------

      Observed package id 'build-tools;23.0.1' in inconsistent location '/android-sdk/build-tools/current' (Expected '/android-sdk/build-tools/23.0.1')

      Already observed package id 'build-tools;23.0.1' in '/android-sdk/build-tools/23.0.1'. Skipping duplicate at '/android-sdk/build-tools/current'

      Incremental java compilation is an incubating feature.

      :preBuild UP-TO-DATE

      :preDebugBuild UP-TO-DATE

      :checkDebugManifest

      :CordovaLib:preBuild UP-TO-DATE

      :CordovaLib:preDebugBuild UP-TO-DATE

      :CordovaLib:compileDebugNdk UP-TO-DATE

      :CordovaLib:compileLint

      :CordovaLib:copyDebugLint UP-TO-DATE

      :CordovaLib:mergeDebugProguardFiles

      :CordovaLib:packageDebugRenderscript UP-TO-DATE

      :CordovaLib:checkDebugManifest

      :CordovaLib:prepareDebugDependencies

      :CordovaLib:compileDebugRenderscript

      :CordovaLib:generateDebugResValues

      :CordovaLib:generateDebugResources

      :CordovaLib:packageDebugResources

      :CordovaLib:compileDebugAidl

      :CordovaLib:generateDebugBuildConfig

      :CordovaLib:mergeDebugShaders

      :CordovaLib:compileDebugShaders

      :CordovaLib:generateDebugAssets

      :CordovaLib:mergeDebugAssets

      :CordovaLib:processDebugManifest

      :CordovaLib:processDebugResources

      :CordovaLib:generateDebugSources

      :CordovaLib:incrementalDebugJavaCompilationSafeguard

      :CordovaLib:compileDebugJavaWithJavac

      :CordovaLib:compileDebugJavaWithJavac - is not incremental (e.g. outputs have changed, no previous execution, etc.).

      Note: Some input files use or override a deprecated API.

      Note: Recompile with -Xlint:deprecation for details.

      :CordovaLib:processDebugJavaRes UP-TO-DATE

      :CordovaLib:transformResourcesWithMergeJavaResForDebug

      :CordovaLib:transformClassesAndResourcesWithSyncLibJarsForDebug

      :CordovaLib:mergeDebugJniLibFolders

      :CordovaLib:transformNative_libsWithMergeJniLibsForDebug

      :CordovaLib:transformNative_libsWithSyncJniLibsForDebug

      :CordovaLib:bundleDebug

      :prepareProjectCordovaLibUnspecifiedDebugLibrary

      :prepareDebugDependencies

      :compileDebugAidl

      :compileDebugRenderscript

      :generateDebugBuildConfig

      :mergeDebugShaders

      :compileDebugShaders

      :generateDebugAssets

      :mergeDebugAssets

      :generateDebugResValues

      :generateDebugResources

      :mergeDebugResources

      :processDebugManifest/project/AndroidManifest.xml:14:13-30 Error:

      Missing one of the key attributes 'action#name,category#name' on element intent-filter at AndroidManifest.xml:14:13-30

      /project/AndroidManifest.xml Error:

      Validation failed, exiting

       

       

      See http://g.co/androidstudio/manifest-merger for more information about the manifest merger.

       

      :processDebugManifest FAILED

       

      FAILURE: Build failed with an exception.

       

      * What went wrong:

      Execution failed for task ':processDebugManifest'.

      > Manifest merger failed with multiple errors, see logs

       

      * Try:

      Run with --stacktrace option to get the stack trace. Run with --info or --debug option to get more log output.

       

      BUILD FAILED

       

      Total time: 2.266 secs

      Error: /project/gradlew: Command failed with exit code 1 Error output:

      Note: Some input files use or override a deprecated API.

      Note: Recompile with -Xlint:deprecation for details.

      /project/AndroidManifest.xml:14:13-30 Error:

      Missing one of the key attributes 'action#name,category#name' on element intent-filter at AndroidManifest.xml:14:13-30

      /project/AndroidManifest.xml Error:

      Validation failed, exiting

       

      FAILURE: Build failed with an exception.

       

      * What went wrong:

      Execution failed for task ':processDebugManifest'.

      > Manifest merger failed with multiple errors, see logs

       

      * Try:

      Run with --stacktrace option to get the stack trace. Run with --info or --debug option to get more log output.

        at ChildProcess.whenDone (/project/cordova/node_modules/cordova-common/src/superspawn.js:169:23)

        at emitTwo (events.js:87:13)

        at ChildProcess.emit (events.js:172:7)

        at maybeClose (internal/child_process.js:818:16)

        at Process.ChildProcess._handle.onexit (internal/child_process.js:211:5)