2 Replies Latest reply on Feb 3, 2017 1:13 AM by briannyagol

    Could not find any version that matches com.google.android.gms:play-services-gcm:9.8+

    jhonnya53729750

      Build Date: 2016-11-02 19:06:15 +0000

      Configuration on demand is an incubating feature.

      Incremental java compilation is an incubating feature.

      Download https://jcenter.bintray.com/com/commit451/PhotoView/1.2.4/PhotoView-1.2.4.pom

      Download https://repo1.maven.org/maven2/com/squareup/picasso/picasso/2.5.2/picasso-2.5.2.pom

      Download https://repo1.maven.org/maven2/com/squareup/picasso/picasso-parent/2.5.2/picasso-parent-2. 5.2.pom

       

      FAILURE: Build failed with an exception.

       

      * What went wrong:

      A problem occurred configuring root project 'project'.

      > Could not resolve all dependencies for configuration ':_debugCompile'.

        > Could not find any version that matches com.google.android.gms:play-services-gcm:9.8+.

        Versions that do not match:

        9.4.0

        9.2.1

        9.2.0

        9.0.2

        9.0.1

        + 5 more

        Searched in the following locations:

        https://repo1.maven.org/maven2/com/google/android/gms/play-services-gcm/maven-metadata.xml

        https://repo1.maven.org/maven2/com/google/android/gms/play-services-gcm/

        https://jcenter.bintray.com/com/google/android/gms/play-services-gcm/maven-metadata.xml

        https://jcenter.bintray.com/com/google/android/gms/play-services-gcm/

        file:/project/libs/

        file:/android-sdk/extras/android/m2repository/com/google/android/gms/play-services-gcm/ma ven-metadata.xml

        file:/android-sdk/extras/android/m2repository/com/google/android/gms/play-services-gcm/

        file:/android-sdk/extras/google/m2repository/com/google/android/gms/play-services-gcm/mav en-metadata.xml

        Required by:

        :project:unspecified

       

      * Try:

      Run with --stacktrace option to get the stack trace. Run with --info or --debug option to get more log output.

       

      BUILD FAILED

       

      Total time: 2.063 secs

      Error: /project/gradlew: Command failed with exit code 1 Error output:

      FAILURE: Build failed with an exception.

       

      * What went wrong:

      A problem occurred configuring root project 'project'.

      > Could not resolve all dependencies for configuration ':_debugCompile'.

        > Could not find any version that matches com.google.android.gms:play-services-gcm:9.8+.

        Versions that do not match:

        9.4.0

        9.2.1

        9.2.0

        9.0.2

        9.0.1

        + 5 more

        Searched in the following locations:

        https://repo1.maven.org/maven2/com/google/android/gms/play-services-gcm/maven-metadata.xml

        https://repo1.maven.org/maven2/com/google/android/gms/play-services-gcm/

        https://jcenter.bintray.com/com/google/android/gms/play-services-gcm/maven-metadata.xml

        https://jcenter.bintray.com/com/google/android/gms/play-services-gcm/

        file:/project/libs/

        file:/android-sdk/extras/android/m2repository/com/google/android/gms/play-services-gcm/ma ven-metadata.xml

        file:/android-sdk/extras/android/m2repository/com/google/android/gms/play-services-gcm/

        file:/android-sdk/extras/google/m2repository/com/google/android/gms/play-services-gcm/mav en-metadata.xml

        Required by:

        :project:unspecified

       

      * Try:

      Run with --stacktrace option to get the stack trace. Run with --info or --debug option to get more log output.

        at ChildProcess.whenDone (/project/cordova/node_modules/cordova-common/src/superspawn.js:169:23)

        at emitTwo (events.js:106:13)

        at ChildProcess.emit (events.js:191:7)

        at maybeClose (internal/child_process.js:877:16)

        at Process.ChildProcess._handle.onexit (internal/child_process.js:226:5)