3 Replies Latest reply on Dec 1, 2016 2:25 PM by vangroover

    Build failure. Ideas?

    paulh43311058

      My build failed with the following log. Any ideas?

       

      FAILURE: Build failed with an exception.

       

      * What went wrong:

      Execution failed for task ':transformClassesWithDexForArmv7Release'.

      > com.android.ide.common.process.ProcessException: org.gradle.process.internal.ExecException: Process 'command '/usr/lib/jvm/java-1.8.0-openjdk-1.8.0.111-1.b15.25.amzn1.x86_64/bin/java'' finished with non-zero exit value 137

       

       

      Build Date: 2016-11-30 17:16:14 +0000

      Configuration on demand is an incubating feature.

      null

      org.xwalk:xwalk_core_library:19+

      :preBuild UP-TO-DATE

      :preArmv7ReleaseBuild UP-TO-DATE

      :checkArmv7ReleaseManifest

      :preArmv7DebugBuild UP-TO-DATE

      :preX86DebugBuild UP-TO-DATE

      :preX86ReleaseBuild UP-TO-DATE

      :CordovaLib:preBuild UP-TO-DATE

      :CordovaLib:preDebugBuild UP-TO-DATE

      :CordovaLib:compileDebugNdk UP-TO-DATE

      :CordovaLib:compileLint

      :CordovaLib:copyDebugLint UP-TO-DATE

      :CordovaLib:mergeDebugProguardFiles

      :CordovaLib:packageDebugRenderscript UP-TO-DATE

      :CordovaLib:checkDebugManifest

      :CordovaLib:prepareDebugDependencies

      :CordovaLib:compileDebugRenderscript

      :CordovaLib:generateDebugResValues

      :CordovaLib:generateDebugResources

      :CordovaLib:packageDebugResources

      :CordovaLib:compileDebugAidl

      :CordovaLib:generateDebugBuildConfig

      :CordovaLib:generateDebugAssets UP-TO-DATE

      :CordovaLib:mergeDebugAssets

      :CordovaLib:processDebugManifest

      :CordovaLib:processDebugResources

      :CordovaLib:generateDebugSources

      :CordovaLib:compileDebugJavaWithJavacNote: Some input files use or override a deprecated API.

      Note: Recompile with -Xlint:deprecation for details.

       

      :CordovaLib:processDebugJavaRes UP-TO-DATE

      :CordovaLib:transformResourcesWithMergeJavaResForDebug

      :CordovaLib:transformClassesAndResourcesWithSyncLibJarsForDebug

      :CordovaLib:mergeDebugJniLibFolders

      :CordovaLib:transformNative_libsWithMergeJniLibsForDebug

      :CordovaLib:transformNative_libsWithSyncJniLibsForDebug

      :CordovaLib:bundleDebug

      :CordovaLib:preReleaseBuild UP-TO-DATE

      :CordovaLib:compileReleaseNdk UP-TO-DATE

      :CordovaLib:copyReleaseLint UP-TO-DATE

      :CordovaLib:mergeReleaseProguardFiles

      :CordovaLib:packageReleaseRenderscript UP-TO-DATE

      :CordovaLib:checkReleaseManifest

      :CordovaLib:prepareReleaseDependencies

      :CordovaLib:compileReleaseRenderscript

      :CordovaLib:generateReleaseResValues

      :CordovaLib:generateReleaseResources

      :CordovaLib:packageReleaseResources

      :CordovaLib:compileReleaseAidl

      :CordovaLib:generateReleaseBuildConfig

      :CordovaLib:generateReleaseAssets UP-TO-DATE

      :CordovaLib:mergeReleaseAssets

      :CordovaLib:processReleaseManifest

      :CordovaLib:processReleaseResources

      :CordovaLib:generateReleaseSources

      :CordovaLib:compileReleaseJavaWithJavacNote: Some input files use or override a deprecated API.

      Note: Recompile with -Xlint:deprecation for details.

       

      :CordovaLib:processReleaseJavaRes UP-TO-DATE

      :CordovaLib:transformResourcesWithMergeJavaResForRelease

      :CordovaLib:transformClassesAndResourcesWithSyncLibJarsForRelease

      :CordovaLib:mergeReleaseJniLibFolders

      :CordovaLib:transformNative_libsWithMergeJniLibsForRelease

      :CordovaLib:transformNative_libsWithSyncJniLibsForRelease

      :CordovaLib:bundleRelease

      :prepareComAndroidSupportSupportCompat2500Library

      :prepareComAndroidSupportSupportCoreUi2500Library

      :prepareComAndroidSupportSupportCoreUtils2500Library

      :prepareComAndroidSupportSupportFragment2500Library

      :prepareComAndroidSupportSupportMediaCompat2500Library

      :prepareComAndroidSupportSupportV42500Library

      :prepareComGoogleAndroidGmsPlayServicesAds980Library

      :prepareComGoogleAndroidGmsPlayServicesAdsLite980Library

      :prepareComGoogleAndroidGmsPlayServicesBase980Library

      :prepareComGoogleAndroidGmsPlayServicesBasement980Library

      :prepareComGoogleAndroidGmsPlayServicesClearcut980Library

      :prepareComGoogleAndroidGmsPlayServicesGass980Library

      :prepareComGoogleAndroidGmsPlayServicesGcm980Library

      :prepareComGoogleAndroidGmsPlayServicesIid980Library

      :prepareComGoogleAndroidGmsPlayServicesLocation980Library

      :prepareComGoogleAndroidGmsPlayServicesTasks980Library

      :prepareComPushwooshPushwoosh4106Library

      :prepareOrgXwalkXwalk_core_library19495145Library

      :prepareProjectCordovaLibUnspecifiedReleaseLibrary

      :prepareArmv7ReleaseDependencies

      :compileArmv7ReleaseAidl

      :compileArmv7ReleaseRenderscript

      :generateArmv7ReleaseBuildConfig

      :generateArmv7ReleaseAssets UP-TO-DATE

      :mergeArmv7ReleaseAssets

      :createXwalkCommandLineFileArmv7Release

      :generateArmv7ReleaseResValues

      :generateArmv7ReleaseResources

      :mergeArmv7ReleaseResources

      :processArmv7ReleaseManifest

      :processArmv7ReleaseResources

      :generateArmv7ReleaseSources

      :compileArmv7ReleaseJavaWithJavacNote: Some input files use or override a deprecated API.

      Note: Recompile with -Xlint:deprecation for details.

      Note: Some input files use unchecked or unsafe operations.

      Note: Recompile with -Xlint:unchecked for details.

       

      :compileArmv7ReleaseNdk UP-TO-DATE

      :compileArmv7ReleaseSources

      :transformClassesWithDexForArmv7Release FAILED

       

      BUILD FAILED

       

      Total time: 49.252 secs

       

      FAILURE: Build failed with an exception.

       

      * What went wrong:

      Execution failed for task ':transformClassesWithDexForArmv7Release'.

      > com.android.ide.common.process.ProcessException: org.gradle.process.internal.ExecException: Process 'command '/usr/lib/jvm/java-1.8.0-openjdk-1.8.0.111-1.b15.25.amzn1.x86_64/bin/java'' finished with non-zero exit value 137

       

      * Try:

      Run with --stacktrace option to get the stack trace. Run with --info or --debug option to get more log output.

      undefined