1 Reply Latest reply on Feb 1, 2017 10:11 AM by johng73239059

    Android apps no longer build

    johng73239059

      My android apps are no longer building (no code change on my part)...Anyone else having issues?

       

      Here is one of my error logs:

      Build Date: 2017-02-01 17:58:29 +0000

      Configuration on demand is an incubating feature.

      Incremental java compilation is an incubating feature.

      :preBuild UP-TO-DATE

      :preReleaseBuild UP-TO-DATE

      :checkReleaseManifest

      :preDebugBuild UP-TO-DATE

      :CordovaLib:preBuild UP-TO-DATE

      :CordovaLib:preDebugBuild UP-TO-DATE

      :CordovaLib:compileDebugNdk UP-TO-DATE

      :CordovaLib:compileLint

      :CordovaLib:copyDebugLint UP-TO-DATE

      :CordovaLib:mergeDebugProguardFiles

      :CordovaLib:packageDebugRenderscript UP-TO-DATE

      :CordovaLib:checkDebugManifest

      :CordovaLib:prepareDebugDependencies

      :CordovaLib:compileDebugRenderscript

      :CordovaLib:generateDebugResValues

      :CordovaLib:generateDebugResources

      :CordovaLib:packageDebugResources

      :CordovaLib:compileDebugAidl

      :CordovaLib:generateDebugBuildConfig

      :CordovaLib:mergeDebugShaders

      :CordovaLib:compileDebugShaders

      :CordovaLib:generateDebugAssets

      :CordovaLib:mergeDebugAssets

      :CordovaLib:processDebugManifest

      :CordovaLib:processDebugResources

      :CordovaLib:generateDebugSources

      :CordovaLib:incrementalDebugJavaCompilationSafeguard

      :CordovaLib:compileDebugJavaWithJavac

      :CordovaLib:compileDebugJavaWithJavac - is not incremental (e.g. outputs have changed, no previous execution, etc.).

      Note: Some input files use or override a deprecated API.

      Note: Recompile with -Xlint:deprecation for details.

      :CordovaLib:processDebugJavaRes UP-TO-DATE

      :CordovaLib:transformResourcesWithMergeJavaResForDebug

      :CordovaLib:transformClassesAndResourcesWithSyncLibJarsForDebug

      :CordovaLib:mergeDebugJniLibFolders

      :CordovaLib:transformNative_libsWithMergeJniLibsForDebug

      :CordovaLib:transformNative_libsWithSyncJniLibsForDebug

      :CordovaLib:bundleDebug

      :CordovaLib:preReleaseBuild UP-TO-DATE

      :CordovaLib:compileReleaseNdk UP-TO-DATE

      :CordovaLib:copyReleaseLint UP-TO-DATE

      :CordovaLib:mergeReleaseProguardFiles

      :CordovaLib:packageReleaseRenderscript UP-TO-DATE

      :CordovaLib:checkReleaseManifest

      :CordovaLib:prepareReleaseDependencies

      :CordovaLib:compileReleaseRenderscript

      :CordovaLib:generateReleaseResValues

      :CordovaLib:generateReleaseResources

      :CordovaLib:packageReleaseResources

      :CordovaLib:compileReleaseAidl

      :CordovaLib:generateReleaseBuildConfig

      :CordovaLib:mergeReleaseShaders

      :CordovaLib:compileReleaseShaders

      :CordovaLib:generateReleaseAssets

      :CordovaLib:mergeReleaseAssets

      :CordovaLib:processReleaseManifest

      :CordovaLib:processReleaseResources

      :CordovaLib:generateReleaseSources

      :CordovaLib:incrementalReleaseJavaCompilationSafeguard

      :CordovaLib:compileReleaseJavaWithJavac

      :CordovaLib:compileReleaseJavaWithJavac - is not incremental (e.g. outputs have changed, no previous execution, etc.).

      Note: Some input files use or override a deprecated API.

      Note: Recompile with -Xlint:deprecation for details.

      :CordovaLib:processReleaseJavaRes UP-TO-DATE

      :CordovaLib:transformResourcesWithMergeJavaResForRelease

      :CordovaLib:transformClassesAndResourcesWithSyncLibJarsForRelease

      :CordovaLib:mergeReleaseJniLibFolders

      :CordovaLib:transformNative_libsWithMergeJniLibsForRelease

      :CordovaLib:transformNative_libsWithSyncJniLibsForRelease

      :CordovaLib:bundleRelease

      :prepareComAndroidSupportSupportV42411Library

      :prepareProjectCordovaLibUnspecifiedReleaseLibrary

      :prepareReleaseDependencies

      :compileReleaseAidl

      :compileReleaseRenderscript

      :generateReleaseBuildConfig

      :mergeReleaseShaders

      :compileReleaseShaders

      :generateReleaseAssets

      :mergeReleaseAssets

      :generateReleaseResValues

      :generateReleaseResources

      :mergeReleaseResources

      :processReleaseManifest/project/AndroidManifest.xml:40:5-60 Error:

      Element uses-feature#android.hardware.camera at AndroidManifest.xml:40:5-60 duplicated with element declared at AndroidManifest.xml:39:5-85

      /project/AndroidManifest.xml Error:

      Validation failed, exiting

       

       

      See http://g.co/androidstudio/manifest-merger for more information about the manifest merger.

       

      :processReleaseManifest FAILED

       

      FAILURE: Build failed with an exception.

       

      * What went wrong:

      Execution failed for task ':processReleaseManifest'.

      > Manifest merger failed with multiple errors, see logs

       

      * Try:

      Run with --stacktrace option to get the stack trace. Run with --info or --debug option to get more log output.

       

      BUILD FAILED

       

      Total time: 2.539 secs

      Error: /project/gradlew: Command failed with exit code 1 Error output:

      Note: Some input files use or override a deprecated API.

      Note: Recompile with -Xlint:deprecation for details.

      Note: Some input files use or override a deprecated API.

      Note: Recompile with -Xlint:deprecation for details.

      /project/AndroidManifest.xml:40:5-60 Error:

      Element uses-feature#android.hardware.camera at AndroidManifest.xml:40:5-60 duplicated with element declared at AndroidManifest.xml:39:5-85

      /project/AndroidManifest.xml Error:

      Validation failed, exiting

       

      FAILURE: Build failed with an exception.

       

      * What went wrong:

      Execution failed for task ':processReleaseManifest'.

      > Manifest merger failed with multiple errors, see logs

       

      * Try:

      Run with --stacktrace option to get the stack trace. Run with --info or --debug option to get more log output.

        at ChildProcess.whenDone (/project/cordova/node_modules/cordova-common/src/superspawn.js:169:23)

        at emitTwo (events.js:106:13)

        at ChildProcess.emit (events.js:191:7)

        at maybeClose (internal/child_process.js:877:16)

        at Process.ChildProcess._handle.onexit (internal/child_process.js:226:5)