5 Replies Latest reply on Feb 4, 2017 3:05 PM by vangroover

    Suddenly android build Fail after updated to cli-6.5.0

    ihernandezp

      Please Help! I don't understand why my app don't bulid.

      This is my app ID: 2205502

       

      This is the output:

      FAILED

       

      FAILURE: Build failed with an exception.

       

      * What went wrong:

      Execution failed for task ':processDebugResources'.

      > com.android.ide.common.process.ProcessException: Failed to execute aapt

       

      * Try:

      Run with --stacktrace option to get the stack trace. Run with --info or --debug option to get more log output.

       

      BUILD FAILED

       

      Total time: 2.128 secs

      Error: /project/gradlew: Command failed with exit code 1 Error output:

      Note: Some input files use or override a deprecated API.

      Note: Recompile with -Xlint:deprecation for details.

      Note: Some input files use or override a deprecated API.

      Note: Recompile with -Xlint:deprecation for details.

      /project/build/intermediates/manifests/full/debug/AndroidManifest.xml:32:23-37: AAPT: No resource found that matches the given name (at 'icon' with value '@drawable/icon').

        

      Warning: AndroidManifest.xml already defines debuggable (in http://schemas.android.com/apk/res/android); using existing value in manifest.

      /project/build/intermediates/manifests/full/debug/AndroidManifest.xml:29: error: Error: No resource found that matches the given name (at 'icon' with value '@drawable/icon').

       

       

       

      FAILURE: Build failed with an exception.

       

      * What went wrong:

      Execution failed for task ':processDebugResources'.

      > com.android.ide.common.process.ProcessException: Failed to execute aapt

       

      * Try:

      Run with --stacktrace option to get the stack trace. Run with --info or --debug option to get more log output.

        at ChildProcess.whenDone (/project/cordova/node_modules/cordova-common/src/superspawn.js:169:23)

        at emitTwo (events.js:106:13)

        at ChildProcess.emit (events.js:191:7)

        at maybeClose (internal/child_process.js:877:16)

        at Process.ChildProcess._handle.onexit (internal/child_process.js:226:5)