6 Replies Latest reply on Feb 4, 2017 3:06 PM by vangroover

    People with build failed

    Sunny Pek Level 1

      People with build error similar to the one below do this.

       

      Add <preference name="phonegap-version" value="cli-6.3.1" /> to the config.xml under </author> closing tag.

       

      Cheers

       

      Build Date: 2017-02-03 02:50:27 +0000

      --------------------------------------------------------------------------------

      PLUGIN OUTPUT

      --------------------------------------------------------------------------------

      Fetching plugin "cordova-plugin-whitelist@1" via npm

      Installing "cordova-plugin-whitelist" at "1.3.1" for android

       

        This plugin is only applicable for versions of cordova-android greater than 4.0. If you have a previous platform version, you do *not* need this plugin since the whitelist will be built in.

      --------------------------------------------------------------------------------

      COMPILE OUTPUT

      --------------------------------------------------------------------------------

      Subproject Path: CordovaLib

      Configuration on demand is an incubating feature.

      Incremental java compilation is an incubating feature.

      :preBuild UP-TO-DATE

      :preDebugBuild UP-TO-DATE

      :checkDebugManifest

      :CordovaLib:preBuild UP-TO-DATE

      :CordovaLib:preDebugBuild UP-TO-DATE

      :CordovaLib:checkDebugManifest

      :CordovaLib:prepareDebugDependencies

      :CordovaLib:compileDebugAidl

      :CordovaLib:compileDebugNdk UP-TO-DATE

      :CordovaLib:compileLint

      :CordovaLib:copyDebugLint UP-TO-DATE

      :CordovaLib:mergeDebugShaders

      :CordovaLib:compileDebugShaders

      :CordovaLib:generateDebugAssets

      :CordovaLib:mergeDebugAssets

      :CordovaLib:mergeDebugProguardFiles

      :CordovaLib:packageDebugRenderscript UP-TO-DATE

      :CordovaLib:compileDebugRenderscript

      :CordovaLib:generateDebugResValues

      :CordovaLib:generateDebugResources

      :CordovaLib:packageDebugResources

      :CordovaLib:processDebugManifest

      :CordovaLib:generateDebugBuildConfig

      :CordovaLib:processDebugResources

      :CordovaLib:generateDebugSources

      :CordovaLib:incrementalDebugJavaCompilationSafeguard

      :CordovaLib:compileDebugJavaWithJavac

      :CordovaLib:compileDebugJavaWithJavac - is not incremental (e.g. outputs have changed, no previous execution, etc.).

      Note: Some input files use or override a deprecated API.

      Note: Recompile with -Xlint:deprecation for details.

      :CordovaLib:processDebugJavaRes UP-TO-DATE

      :CordovaLib:transformResourcesWithMergeJavaResForDebug

      :CordovaLib:transformClassesAndResourcesWithSyncLibJarsForDebug

      :CordovaLib:mergeDebugJniLibFolders

      :CordovaLib:transformNative_libsWithMergeJniLibsForDebug

      :CordovaLib:transformNative_libsWithSyncJniLibsForDebug

      :CordovaLib:bundleDebug

      :prepareProjectCordovaLibUnspecifiedDebugLibrary

      :prepareDebugDependencies

      :compileDebugAidl

      :compileDebugRenderscript

      :generateDebugBuildConfig

      :generateDebugResValues

      :generateDebugResources

      :mergeDebugResources

      :processDebugManifest

      :processDebugResources/project/build/intermediates/manifests/full/debug/AndroidManifest.xm l:25:23-37: AAPT: No resource found that matches the given name (at 'icon' with value '@drawable/icon').

        

      Warning: AndroidManifest.xml already defines debuggable (in http://schemas.android.com/apk/res/android); using existing value in manifest.

      /project/build/intermediates/manifests/full/debug/AndroidManifest.xml:22: error: Error: No resource found that matches the given name (at 'icon' with value '@drawable/icon').

       

       

      FAILED

       

      FAILURE: Build failed with an exception.

       

      * What went wrong:

      Execution failed for task ':processDebugResources'.

      > com.android.ide.common.process.ProcessException: Failed to execute aapt

       

      * Try:

      Run with --stacktrace option to get the stack trace. Run with --info or --debug option to get more log output.

       

      BUILD FAILED

       

      Total time: 1.704 secs

      Error: /project/gradlew: Command failed with exit code 1 Error output:

      Note: Some input files use or override a deprecated API.

      Note: Recompile with -Xlint:deprecation for details.

      /project/build/intermediates/manifests/full/debug/AndroidManifest.xml:25:23-37: AAPT: No resource found that matches the given name (at 'icon' with value '@drawable/icon').

        

      Warning: AndroidManifest.xml already defines debuggable (in http://schemas.android.com/apk/res/android); using existing value in manifest.

      /project/build/intermediates/manifests/full/debug/AndroidManifest.xml:22: error: Error: No resource found that matches the given name (at 'icon' with value '@drawable/icon').

       

       

       

      FAILURE: Build failed with an exception.

       

      * What went wrong:

      Execution failed for task ':processDebugResources'.

      > com.android.ide.common.process.ProcessException: Failed to execute aapt

       

      * Try:

      Run with --stacktrace option to get the stack trace. Run with --info or --debug option to get more log output.

        at ChildProcess.whenDone (/project/cordova/node_modules/cordova-common/src/superspawn.js:169:23)

        at emitTwo (events.js:106:13)

        at ChildProcess.emit (events.js:191:7)

        at maybeClose (internal/child_process.js:877:16)

        at Process.ChildProcess._handle.onexit (internal/child_process.js:226:5)