3 Replies Latest reply on Feb 8, 2017 12:20 PM by kerrishotts

    Problem ID 2472080

    inueva Level 1

      Cant compile on Android. Changed phonegap 6.3.0 to 6.3.1 without success.

        • 1. Re: Problem ID 2472080
          VectorP Level 4

          Does the build log offer additional information?

          • 2. Re: Problem ID 2472080
            inueva Level 1

            :processReleaseResources/project/build/intermediates/res/merged/release/values-v24/values- v24.xml:3: AAPT: Error retrieving parent for item: No resource found that matches the given name 'android:TextAppearance.Material.Widget.Button.Borderless.Colored'.

              

            /project/build/intermediates/res/merged/release/values-v24/values-v24.xml:4: AAPT: Error retrieving parent for item: No resource found that matches the given name 'android:TextAppearance.Material.Widget.Button.Colored'.

              

            FAILED

             

            FAILURE: Build failed with an exception.

             

            * What went wrong:

            Execution failed for task ':processReleaseResources'.

            > com.android.ide.common.process.ProcessException: org.gradle.process.internal.ExecException: Process 'command '/android-sdk/build-tools/24.0.1/aapt'' finished with non-zero exit value 1

             

            * Try:

            Run with --stacktrace option to get the stack trace. Run with --info or --debug option to get more log output.

             

            BUILD FAILED

             

            Total time: 24.158 secs

            Error: /project/gradlew: Command failed with exit code 1 Error output:

            Note: Some input files use or override a deprecated API.

            Note: Recompile with -Xlint:deprecation for details.

            Note: Some input files use or override a deprecated API.

            Note: Recompile with -Xlint:deprecation for details.

            /project/build/intermediates/res/merged/release/values-v24/values-v24.xml:3: AAPT: Error retrieving parent for item: No resource found that matches the given name 'android:TextAppearance.Material.Widget.Button.Borderless.Colored'.

              

            /project/build/intermediates/res/merged/release/values-v24/values-v24.xml:4: AAPT: Error retrieving parent for item: No resource found that matches the given name 'android:TextAppearance.Material.Widget.Button.Colored'.

              

             

            FAILURE: Build failed with an exception.

             

            * What went wrong:

            Execution failed for task ':processReleaseResources'.

            > com.android.ide.common.process.ProcessException: org.gradle.process.internal.ExecException: Process 'command '/android-sdk/build-tools/24.0.1/aapt'' finished with non-zero exit value 1