0 Replies Latest reply on Mar 16, 2017 1:23 AM by SudeepAdobe

    :processReleaseManifest FAILED

    SudeepAdobe Level 1


      I'm developing an android on Windows 10 in Cordova. When I build the app I'm receiving build error as below.

      App ID: 2106700







      :processReleaseManifest/project/AndroidManifest.xml:35:9-159 Error:

      Element activity#com.facebook.LoginActivity at AndroidManifest.xml:35:9-159 duplicated with element declared at AndroidManifest.xml:20:9-96

      /project/AndroidManifest.xml Error:

      Validation failed, exiting



      See http://g.co/androidstudio/manifest-merger for more information about the manifest merger.


      :processReleaseManifest FAILED


      FAILURE: Build failed with an exception.


      * What went wrong:

      Execution failed for task ':processReleaseManifest'.

      > Manifest merger failed with multiple errors, see logs


      * Try:

      Run with --stacktrace option to get the stack trace. Run with --info or --debug option to get more log output.




      Total time: 13.549 secs