1 Reply Latest reply on Apr 15, 2017 12:04 PM by peterw14909681

    ClevertTap-cordova plugin applicationId

    NielsvdBoogaart

      Link to plugin: GitHub - CleverTap/clevertap-cordova: CleverTap Cordova Plugin

       

      Followed it's documentation into installing the plugin

       

      Attempt to run $: phonegap build android    

       

      (Ios is working just fine)

       

      App ID: 2570045

       

      Error log:

       

      Build Date: 2017-04-14 09:14:00 +0000

      Subproject Path: CordovaLib

      Configuration on demand is an incubating feature.

      Incremental java compilation is an incubating feature.

      :preBuild UP-TO-DATE

      :preReleaseBuild UP-TO-DATE

      :checkReleaseManifest

      :preDebugBuild UP-TO-DATE

      :CordovaLib:preBuild UP-TO-DATE

      :CordovaLib:preDebugBuild UP-TO-DATE

      :CordovaLib:checkDebugManifest

      :CordovaLib:prepareDebugDependencies

      :CordovaLib:compileDebugAidl

      :CordovaLib:compileDebugNdk UP-TO-DATE

      :CordovaLib:compileLint

      :CordovaLib:copyDebugLint UP-TO-DATE

      :CordovaLib:mergeDebugShaders

      :CordovaLib:compileDebugShaders

      :CordovaLib:generateDebugAssets

      :CordovaLib:mergeDebugAssets

      :CordovaLib:mergeDebugProguardFiles

      :CordovaLib:packageDebugRenderscript UP-TO-DATE

      :CordovaLib:compileDebugRenderscript

      :CordovaLib:generateDebugResValues

      :CordovaLib:generateDebugResources

      :CordovaLib:packageDebugResources

      :CordovaLib:processDebugManifest

      :CordovaLib:generateDebugBuildConfig

      :CordovaLib:processDebugResources

      :CordovaLib:generateDebugSources

      :CordovaLib:incrementalDebugJavaCompilationSafeguard

      :CordovaLib:compileDebugJavaWithJavac

      :CordovaLib:compileDebugJavaWithJavac - is not incremental (e.g. outputs have changed, no previous execution, etc.).

      Note: Some input files use or override a deprecated API.

      Note: Recompile with -Xlint:deprecation for details.

      :CordovaLib:processDebugJavaRes UP-TO-DATE

      :CordovaLib:transformResourcesWithMergeJavaResForDebug

      :CordovaLib:transformClassesAndResourcesWithSyncLibJarsForDebug

      :CordovaLib:mergeDebugJniLibFolders

      :CordovaLib:transformNative_libsWithMergeJniLibsForDebug

      :CordovaLib:transformNative_libsWithSyncJniLibsForDebug

      :CordovaLib:bundleDebug

      :CordovaLib:preReleaseBuild UP-TO-DATE

      :CordovaLib:checkReleaseManifest

      :CordovaLib:prepareReleaseDependencies

      :CordovaLib:compileReleaseAidl

      :CordovaLib:compileReleaseNdk UP-TO-DATE

      :CordovaLib:copyReleaseLint UP-TO-DATE

      :CordovaLib:mergeReleaseShaders

      :CordovaLib:compileReleaseShaders

      :CordovaLib:generateReleaseAssets

      :CordovaLib:mergeReleaseAssets

      :CordovaLib:mergeReleaseProguardFiles

      :CordovaLib:packageReleaseRenderscript UP-TO-DATE

      :CordovaLib:compileReleaseRenderscript

      :CordovaLib:generateReleaseResValues

      :CordovaLib:generateReleaseResources

      :CordovaLib:packageReleaseResources

      :CordovaLib:processReleaseManifest

      :CordovaLib:generateReleaseBuildConfig

      :CordovaLib:processReleaseResources

      :CordovaLib:generateReleaseSources

      :CordovaLib:incrementalReleaseJavaCompilationSafeguard

      :CordovaLib:compileReleaseJavaWithJavac

      :CordovaLib:compileReleaseJavaWithJavac - is not incremental (e.g. outputs have changed, no previous execution, etc.).

      Note: Some input files use or override a deprecated API.

      Note: Recompile with -Xlint:deprecation for details.

      :CordovaLib:processReleaseJavaRes UP-TO-DATE

      :CordovaLib:transformResourcesWithMergeJavaResForRelease

      :CordovaLib:transformClassesAndResourcesWithSyncLibJarsForRelease

      :CordovaLib:mergeReleaseJniLibFolders

      :CordovaLib:transformNative_libsWithMergeJniLibsForRelease

      :CordovaLib:transformNative_libsWithSyncJniLibsForRelease

      :CordovaLib:bundleRelease

      :prepareComAndroidSupportAnimatedVectorDrawable2520Library

      :prepareComAndroidSupportAppcompatV72520Library

      :prepareComAndroidSupportCardviewV72340Library

      :prepareComAndroidSupportCustomtabs2340Library

      :prepareComAndroidSupportSupportCompat2520Library

      :prepareComAndroidSupportSupportCoreUi2520Library

      :prepareComAndroidSupportSupportCoreUtils2520Library

      :prepareComAndroidSupportSupportFragment2520Library

      :prepareComAndroidSupportSupportMediaCompat2520Library

      :prepareComAndroidSupportSupportV132340Library

      :prepareComAndroidSupportSupportV42520Library

      :prepareComAndroidSupportSupportVectorDrawable2520Library

      :prepareComDigitsSdkAndroidDigits140Library

      :prepareComFacebookAndroidFacebookAndroidSdk4141Library

      :prepareComGoogleAndroidGmsPlayServicesBase980Library

      :prepareComGoogleAndroidGmsPlayServicesBasement980Library

      :prepareComGoogleAndroidGmsPlayServicesGcm980Library

      :prepareComGoogleAndroidGmsPlayServicesIid980Library

      :prepareComGoogleAndroidGmsPlayServicesTasks980Library

      :prepareComTwitterCobaltPerformanceMetrics020Library

      :prepareComTwitterSdkAndroidTweetComposer073Library

      :prepareComTwitterSdkAndroidTweetUi110Library

      :prepareComTwitterSdkAndroidTwitter140Library

      :prepareComTwitterSdkAndroidTwitterCore132Library

      :prepareIoFabricSdkAndroidFabric130Library

      :prepareMeLeolinShortcutBadger114Library

      :prepareProjectCordovaLibUnspecifiedReleaseLibrary

      :prepareReleaseDependencies

      :compileReleaseAidl

      :compileReleaseRenderscript

      :generateReleaseBuildConfig

      :generateReleaseResValues

      :generateReleaseResources

      :mergeReleaseResources

      :processReleaseManifest FAILED

       

      FAILURE: Build failed with an exception.

       

      * What went wrong:

      Execution failed for task ':processReleaseManifest'.

      > No record for key [category#${applicationId}]

       

      * Try:

      Run with --stacktrace option to get the stack trace. Run with --info or --debug option to get more log output.

       

      BUILD FAILED

       

      Total time: 4.809 secs

      Error: /project/gradlew: Command failed with exit code 1 Error output:

      Note: Some input files use or override a deprecated API.

      Note: Recompile with -Xlint:deprecation for details.

      Note: Some input files use or override a deprecated API.

      Note: Recompile with -Xlint:deprecation for details.

       

      FAILURE: Build failed with an exception.

       

      * What went wrong:

      Execution failed for task ':processReleaseManifest'.

      > No record for key [category#${applicationId}]

       

      * Try:

      Run with --stacktrace option to get the stack trace. Run with --info or --debug option to get more log output.

        at ChildProcess.whenDone (/project/cordova/node_modules/cordova-common/src/superspawn.js:169:23)

        at emitTwo (events.js:106:13)

        at ChildProcess.emit (events.js:191:7)

        at maybeClose (internal/child_process.js:877:16)

        at Process.ChildProcess._handle.onexit (internal/child_process.js:226:5)