7 Replies Latest reply on Jun 28, 2017 1:56 PM by ItoolsMobile

    Android Build Failed with: not accepted the license agreements of the following SDK components

    ItoolsMobile

      My Android build started failed to build.  Here are the errors being returned in the log:

       

      Build Date: 2017-06-13 02:42:40 +0000

      Subproject Path: CordovaLib

      Configuration on demand is an incubating feature.

      Incremental java compilation is an in !cubating feature.

       

      FAILURE: Build failed with an exception.

       

      * What went wrong:

      A problem occurred configuring root project 'project'.

      > You have not accepted the license agreements of the following SDK components:

        [SDK Patch Applier v4, Google Repository].

        Before building your project, you need to accept the license agreements and complete the installation of the missing components using the Android Studio SDK Manager.

        Alternatively, to learn how to transfer the license agreements from one workstation to another, go to http://d.android.com/r/studio-ui/export-licenses.html

       

      * Try:

      Run with --stacktrace option to get the stack trace. Run with --info or --debug option to get more log output.

       

      BUILD FAILED

       

      Total time: 2.095 secs

      Error: /project/gradlew: Command failed with exit code 1 Error output:

      FAILURE: Build failed with an exception.

       

      * What went wrong:

      A problem occurred configuring root project 'project'.

      > You have not accepted the license agreements of the following SDK components:

        [SDK Patch Applier v4, Google Repository].

        Before building your project, you need to accept the license agreements and complete the installation of the missing components using the Android Studio SDK Manager.

        Alternatively, to learn how to transfer the license agreements from one workstation to another, go to http://d.android.com/r/studio-ui/export-licenses.html

       

      * Try:

      Run with --stacktrace option to get the stack trace. Run with --info or --debug option to get more log output.

        at ChildProcess.whenDone (/project/cordova/node_modules/cordova-common/src/superspawn.js:169:23)

        at emitTwo (events.js:106:13)

        at ChildProcess.emit (events.js:191:7)

        at maybeClose (internal/child_process.js:877:16)

        at Process.ChildProcess._handle.onexit (internal/child_process.js:226:5)

       

      This seems to be an issue on the build server side.  Any ideas how I can get this building again? My app id is: com.squashthebeef.app1