1 Reply Latest reply on Jun 8, 2018 4:21 PM by igorg50721738

    Missing common-1.0.0.jar resulting in failing Android Builds

    CommonTime Support

      Android PhoneGap Builds are failing, from the log:

       

      FAILURE: Build failed with an exception.

       

      * What went wrong:

      A problem occurred configuring root project 'project'.

      > Could not find common.jar (android.arch.core:common:1.0.0).

        Searched in the following locations:

            https://jcenter.bintray.com/android/arch/core/common/1.0.0/common-1.0.0.jar

       

      * Try:

      Run with --stacktrace option to get the stack trace. Run with --info or --debug option to get more log output.

       

      BUILD FAILED

       

      Total time: 9.267 secs

      Command finished with error code 1: /project/gradlew cdvBuildDebug,-b,/project/build.gradle,-Dorg.gradle.daemon=true,-Pandroid.useDeprecatedNd k=true,-Dorg.gradle.daemon=false

      Error: /project/gradlew: Command failed with exit code 1 Error output:

      FAILURE: Build failed with an exception.

       

      * What went wrong:

      A problem occurred configuring root project 'project'.

      > Could not find common.jar (android.arch.core:common:1.0.0).

        Searched in the following locations:

            https://jcenter.bintray.com/android/arch/core/common/1.0.0/common-1.0.0.jar

       

      Browsing to https://jcenter.bintray.com/android/arch/core/common/1.0.0/common-1.0.0.jar  redirects to the following which results in 404.

       

      https://repo.jfrog.org/artifactory/libs-release-bintray/android/arch/core/common/1.0.0/com mon-1.0.0.jar

       

      Looks like https://repo.jfrog.org/artifactory/libs-release-bintray/android/arch has gone missing?