2 Replies Latest reply on Jun 24, 2010 9:35 AM by clintmodien

    Trunk build failure

    clint.modien

      Checked out the trunk today to build the latest and I received a build failure error when running mvn package.

       

      Here's the error:

       

       

       

      Running de.bokelberg.flex.parser.TestPackageContent
      Tests run: 14, Failures: 0, Errors: 0, Skipped: 0, Time elapsed: 0.007 sec
      Running de.bokelberg.flex.parser.TestInterface
      Tests run: 2, Failures: 0, Errors: 0, Skipped: 0, Time elapsed: 0.003 sec

       

      Results :

       

      Tests run: 128, Failures: 0, Errors: 0, Skipped: 0

       

      [INFO] [jar:jar {execution: default-jar}]
      [INFO] [license:check {execution: default}]
      [INFO] Checking licenses...
      [INFO] ------------------------------------------------------------------------
      [INFO] Building Adobe Flex PMD RuleSet API
      [INFO]    task-segment: [package]
      [INFO] ------------------------------------------------------------------------
      [WARNING] POM for 'jaxen:jaxen:pom:1.1.1:compile' is invalid.

       

      Its dependencies (if any) will NOT be available to the current build.
      [INFO] [dependency:unpack-dependencies {execution: unpack-test-resources}]
      [INFO] Unpacking /Developer/Web/Flex/adobe/flexpmd/as3-parser/target/as3-parser-1.2-SNAPSHOT.jarto
      /Developer/Web/Flex/adobe/flexpmd/flex-pmd-ruleset-api/target/test/generated-resources
      with Includes **/*.as,**/*.mxml and excludes:null
      [INFO] Unpacking /Developer/Web/Flex/adobe/flexpmd/as3-plugin-utils/target/as3-plugin-utils-1.2-SNAPSHOT.j arto
      /Developer/Web/Flex/adobe/flexpmd/flex-pmd-ruleset-api/target/test/generated-resources
      with Includes **/*.as,**/*.mxml and excludes:null
      [INFO] Unpacking /Developer/Web/Flex/adobe/flexpmd/flex-pmd-files/target/flex-pmd-files-1.2-SNAPSHOT.jarto
      /Developer/Web/Flex/adobe/flexpmd/flex-pmd-ruleset-api/target/test/generated-resources
      with Includes **/*.as,**/*.mxml and excludes:null
      [INFO] Unpacking /Developer/Web/Flex/adobe/flexpmd/flex-pmd-test-resources/target/flex-pmd-test-resources- 1.2-SNAPSHOT-resources.zipto
      /Developer/Web/Flex/adobe/flexpmd/flex-pmd-ruleset-api/target/test/generated-resources
      with Includes **/*.as,**/*.mxml and excludes:null
      [INFO] [resources:resources {execution: default-resources}]
      [INFO] Using 'UTF-8' encoding to copy filtered resources.
      [INFO] Copying 1 resource
      [INFO] [compiler:compile {execution: default-compile}]
      [INFO] Nothing to compile - all classes are up to date
      [INFO] [resources:testResources {execution: default-testResources}]
      [INFO] Using 'UTF-8' encoding to copy filtered resources.
      [INFO] Copying 96 resources
      [INFO] Copying 0 resource
      [INFO] [compiler:testCompile {execution: default-testCompile}]
      [INFO] Compiling 5 source files to /Developer/Web/Flex/adobe/flexpmd/flex-pmd-ruleset-api/target/test-classes
      [INFO] ------------------------------------------------------------------------
      [ERROR] BUILD FAILURE
      [INFO] ------------------------------------------------------------------------
      [INFO] Compilation failure

       

      /Developer/Web/Flex/adobe/flexpmd/flex-pmd-ruleset-api/src/test/java/com/adobe/ac/pmd/node s/utils/AsDocUtilsTest.java:[64,53] cannot find symbol
      symbol  : method computeParameterDoc(java.lang.String,java.lang.String)
      location: class com.adobe.ac.pmd.nodes.utils.AsDocUtils

       

      /Developer/Web/Flex/adobe/flexpmd/flex-pmd-ruleset-api/src/test/java/com/adobe/ac/pmd/file s/FileSetUtilsTest.java:[52,39] buildLogMessage(com.adobe.ac.pmd.files.IFlexFile,java.lang.String) has private access in com.adobe.ac.pmd.files.FileSetUtils

       


      [INFO] ------------------------------------------------------------------------
      [INFO] Trace
      org.apache.maven.BuildFailureException: Compilation failure
          at org.apache.maven.lifecycle.DefaultLifecycleExecutor.executeGoals(DefaultLifecycleExecutor .java:715)
          at org.apache.maven.lifecycle.DefaultLifecycleExecutor.executeGoalWithLifecycle(DefaultLifec ycleExecutor.java:556)
          at org.apache.maven.lifecycle.DefaultLifecycleExecutor.executeGoal(DefaultLifecycleExecutor. java:535)
          at org.apache.maven.lifecycle.DefaultLifecycleExecutor.executeGoalAndHandleFailures(DefaultL ifecycleExecutor.java:387)
          at org.apache.maven.lifecycle.DefaultLifecycleExecutor.executeTaskSegments(DefaultLifecycleE xecutor.java:348)
          at org.apache.maven.lifecycle.DefaultLifecycleExecutor.execute(DefaultLifecycleExecutor.java :180)
          at org.apache.maven.DefaultMaven.doExecute(DefaultMaven.java:328)
          at org.apache.maven.DefaultMaven.execute(DefaultMaven.java:138)
          at org.apache.maven.cli.MavenCli.main(MavenCli.java:362)
          at org.apache.maven.cli.compat.CompatibleMain.main(CompatibleMain.java:60)
          at sun.reflect.NativeMethodAccessorImpl.invoke0(Native Method)
          at sun.reflect.NativeMethodAccessorImpl.invoke(NativeMethodAccessorImpl.java:39)
          at sun.reflect.DelegatingMethodAccessorImpl.invoke(DelegatingMethodAccessorImpl.java:25)
          at java.lang.reflect.Method.invoke(Method.java:597)
          at org.codehaus.classworlds.Launcher.launchEnhanced(Launcher.java:315)
          at org.codehaus.classworlds.Launcher.launch(Launcher.java:255)
          at org.codehaus.classworlds.Launcher.mainWithExitCode(Launcher.java:430)
          at org.codehaus.classworlds.Launcher.main(Launcher.java:375)
      Caused by: org.apache.maven.plugin.CompilationFailureException: Compilation failure
          at org.apache.maven.plugin.AbstractCompilerMojo.execute(AbstractCompilerMojo.java:516)
          at org.apache.maven.plugin.TestCompilerMojo.execute(TestCompilerMojo.java:102)
          at org.apache.maven.plugin.DefaultPluginManager.executeMojo(DefaultPluginManager.java:490)
          at org.apache.maven.lifecycle.DefaultLifecycleExecutor.executeGoals(DefaultLifecycleExecutor .java:694)
          ... 17 more
      [INFO] ------------------------------------------------------------------------
      [INFO] Total time: 20 seconds
      [INFO] Finished at: Fri Jun 18 13:57:21 PDT 2010
      [INFO] Final Memory: 72M/460M
      [INFO] ------------------------------------------------------------------------